|
From: Bruce S. <bw...@ar...> - 2003-09-13 13:09:50
|
> > make[1]: Entering directory `/data/build/tmp/python-ldap-20011022' > > cd Modules && make srcdir=/data/build/tmp/python-ldap-20011022/Modules > > VPATH=/data/build/tmp/python-ldap-20011022/Modules > > make[2]: Entering directory `/data/build/tmp/python-ldap-20011022/Modules' > > i586-pc-linux-gnu-gcc -pthread -fPIC -DNDEBUG -g -O3 -Wall > > -Wstrict-prototypes > > -I/data/build/tmp/Python-install/usr/include/python2.3 > > -I/data/build/tmp/Python-install/usr/lib/python2.3/config @DEFS@ -I. > > -DLDAP_REFERRALS -I/data/build/tmp/openldap-1.2.13/include -c > > /data/build/tmp/python-ldap-20011022/Modules/./LDAPObject.c -o > > ./LDAPObject.o > > i586-pc-linux-gnu-gcc: cannot specify -o with -c or -S and multiple > > compilations > > make[2]: *** [LDAPObject.o] Error 1 > > make[2]: Leaving directory > > `/data/build/tmp/python-ldap-20011022/Modules' > > make[1]: *** [_ldapmodule-build] Error 2 > > make[1]: Leaving directory `/data/build/tmp/python-ldap-20011022' > > ERROR > > /data/build/scripts/python-ldap build failed > > make: *** [build] Error 1 > > Strange, that should not have happened. It does, on two different systems. (both with new lfssystems) I've unselected it in the mean time. - BS |