SDL Formal Semantics Tool Chain Icon

beta

User Ratings

★★★★★
★★★★
★★★
★★
1
0
0
0
0
ease 1 of 5 2 of 5 3 of 5 4 of 5 5 of 5 5 / 5
features 1 of 5 2 of 5 3 of 5 4 of 5 5 of 5 5 / 5
design 1 of 5 2 of 5 3 of 5 4 of 5 5 of 5 5 / 5
support 1 of 5 2 of 5 3 of 5 4 of 5 5 of 5 5 / 5
Write a Review

User Reviews

  • 1 of 5 2 of 5 3 of 5 4 of 5 5 of 5

    I have a problem. When I try to compile, I have the following error: -sh-3.2$ make all cd Syntax;make runtime make[1]: se ingresa al directorio `/home/salcaraz/sdlc/SDLC/Syntax' kc++ --yystype syn-abstract.k syn-semantics.k syn-pretty.k syn-genlex.k syn-gentoken.k syn-genyacc.k syn-ast2kst_simple.k syn-genk.k syn-gentxt.k syn-genasm.k syn-genasml.k syn-gensatanictoken.k syn-gensatanicsel.k syn-gensatanicin.k fallthrough.k syn-print.k syn-ast2kst.k kc++: error at syn-genasml.k:1 col:92: syntax error, unexpected $undefined specification -> @1 declarations . declarations -> declarations . declaration ' token last read was: ' make[1]: *** [.kc_time_stamp] Error 1 make[1]: se sale del directorio `/home/salcaraz/sdlc/SDLC/Syntax' make: *** [runtime_syntax] Error 2 ¿could you help me, please?

    Posted 06/12/2014

Thanks for helping keep SourceForge clean.

Screenshot instructions:
Windows
Mac
Red Hat Linux   Ubuntu

Click URL instructions:
Right-click on ad, choose "Copy Link", then paste here →
(This may not be possible with some types of ads)

More information about our ad policies
X

Briefly describe the problem (required):

Upload screenshot of ad (required):
Select a file, or drag & drop file here.

Please provide the ad click URL, if possible:

Get latest updates about Open Source Projects, Conferences and News.

No, thanks