#63 Problem compiling sidplay-libs 2.1.1

open
nobody
None
5
2009-11-10
2009-11-10
Pierre
No

[...]
Making all in sidtune
make[3]: Entering directory `/tmp/sidplay-libs-2.1.1/libsidplay/src/sidtune'
if /bin/sh ../../libtool --mode=compile g++ -DHAVE_CONFIG_H -s -O3 -march=i686 -DHAVE_UNIX -I../../include -I../../include/sidplay -MT IconInfo.lo -MD -MP -MF ".deps/IconInfo.Tpo" -c -o IconInfo.lo IconInfo.cpp; \ then mv -f ".deps/IconInfo.Tpo" ".deps/IconInfo.Plo"; else rm -f ".deps/IconInfo.Tpo"; exit 1; fi
g++ -DHAVE_CONFIG_H -s -O3 -march=i686 -DHAVE_UNIX -I../../include -I../../include/sidplay -MT IconInfo.lo -MD -MP -MF .deps/IconInfo.Tpo -c IconInfo.cpp -fPIC -DPIC -o .libs/IconInfo.o
In file included from ../../include/sidplay/SidTune.h:25,
from IconInfo.cpp:31:
../../include/sidplay/SmartPtr.h: In member function 'void SmartPtr_sidtt<T>::setBuffer(T*, ulint_smartpt)':
../../include/sidplay/SmartPtr.h:214: error: 'pBufCurrent' was not declared in this scope
../../include/sidplay/SmartPtr.h:214: error: 'bufBegin' was not declared in this scope
../../include/sidplay/SmartPtr.h:215: error: 'bufEnd' was not declared in this scope
../../include/sidplay/SmartPtr.h:216: error: 'bufLen' was not declared in this scope
../../include/sidplay/SmartPtr.h:217: error: 'status' was not declared in this scope
../../include/sidplay/SmartPtr.h:221: error: 'pBufCurrent' was not declared in this scope
../../include/sidplay/SmartPtr.h:221: error: 'bufBegin' was not declared in this scope
../../include/sidplay/SmartPtr.h:221: error: 'bufEnd' was not declared in this scope
../../include/sidplay/SmartPtr.h:222: error: 'bufLen' was not declared in this scope
../../include/sidplay/SmartPtr.h:223: error: 'status' was not declared in this scope
make[3]: *** [IconInfo.lo] Error 1
make[3]: Leaving directory `/tmp/sidplay-libs-2.1.1/libsidplay/src/sidtune'
make[2]: *** [all-recursive] Error 1
make[2]: Leaving directory `/tmp/sidplay-libs-2.1.1/libsidplay/src'
make[1]: *** [all-recursive] Error 1
make[1]: Leaving directory `/tmp/sidplay-libs-2.1.1/libsidplay'
make: *** [all-recursive] Error 1

Discussion

Get latest updates about Open Source Projects, Conferences and News.

Sign up for the SourceForge newsletter:





No, thanks