#28 Problem compileing 0.106.1 on solaris 9

open
nobody
None
5
2006-06-01
2006-06-01
No

I use version 0.106.1 with Redhat EL3 en EL4 without
problems.

I use version 0.106.1 with Solaris 9 many problems:

1) - - - - - - - - - - - - - - - - - - - - - - - - - -
-

./configure --prefix=/opt/asnmtap/perfparse --with-
imagedir=/opt/asnmtap/applications/htmlroot/img/
--with-cgidir=/opt/asnmtap/applications/htmlroot/cgi-
bin
--with-http_image_path=/asnmtap/img --with-data-
source=asnmtap --disable-phpui

checking whether NLS is requested... yes
checking whether included gettext is requested... no
checking for GNU gettext in libc... no
checking for GNU gettext in libintl... no
checking whether to use NLS... yes
checking where the gettext function comes from...
included intl directory checking whether glib version
is forced... checking whether glib 2.X can be
found... checking for pkg-
config... /usr/local/bin/pkg-config checking for
GLIB - version >= 2.0.0... no
*** Could not run GLIB test program, checking why...
*** The test program failed to compile or link. See
the file config.log for the
*** exact error that occured. This usually means GLIB
is incorrectly installed.
configure: error: No glib found. Either install glib2
or give the path to glib 1.2 with --use-glib12

2) - - - - - - - - - - - - - - - - - - - - - - - - -
-

./configure --prefix=/opt/asnmtap/perfparse --with-
imagedir=/opt/asnmtap/applications/htmlroot/img/
--with-cgidir=/opt/asnmtap/applications/htmlroot/cgi-
bin
--with-http_image_path=/asnmtap/img --with-data-
source=asnmtap
--disable-phpui --with-glib12=/usr/lib

bash-3.1# make
make all-recursive
make[1]: Entering directory
`/export/home/nagios/installed-packages/perfparse-all'
Making all in intl
make[2]: Entering directory
`/export/home/nagios/installed-packages/perfparse-
all/intl'
make[2]: Nothing to be done for `all'.
make[2]: Leaving directory
`/export/home/nagios/installed-packages/perfparse-
all/intl'
Making all in m4
make[2]: Entering directory
`/export/home/nagios/installed-packages/perfparse-
all/m4'
make[2]: Nothing to be done for `all'.
make[2]: Leaving directory
`/export/home/nagios/installed-packages/perfparse-
all/m4'
Making all in libnagios_perfdata_parser
make[2]: Entering directory
`/export/home/nagios/installed-packages/perfparse-
all/libnagios_perfdata_parser'
make[2]: Nothing to be done for `all'.
make[2]: Leaving directory
`/export/home/nagios/installed-packages/perfparse-
all/libnagios_perfdata_parser'
Making all in libpp_common
make[2]: Entering directory
`/export/home/nagios/installed-packages/perfparse-
all/libpp_common'
make[2]: Nothing to be done for `all'.
make[2]: Leaving directory
`/export/home/nagios/installed-packages/perfparse-
all/libpp_common'
Making all in libpp_mysql
make[2]: Entering directory
`/export/home/nagios/installed-packages/perfparse-
all/libpp_mysql'
make[2]: Nothing to be done for `all'.
make[2]: Leaving directory
`/export/home/nagios/installed-packages/perfparse-
all/libpp_mysql'
Making all in modules
make[2]: Entering directory
`/export/home/nagios/installed-packages/perfparse-
all/modules'
make[2]: Nothing to be done for `all'.
make[2]: Leaving directory
`/export/home/nagios/installed-packages/perfparse-
all/modules'
Making all in perfparse
make[2]: Entering directory
`/export/home/nagios/installed-packages/perfparse-
all/perfparse'
/bin/bash ../libtool --mode=link --tag=CC gcc -g -
O2 -Wall -o
perfparse-log2any perfparse_log2any-perfparse-
log2any.o
perfparse_log2any-perfparse-common.o
perfparse_log2any-log_reader.o perfparse_log2any-
storage.o -L../libpp_common -lpp_common -
L../libnagios_perfdata_parser -
lnagios_perfdata_parser -L/usr/local/lib -
lglib ../intl/libintl.a -liconv -lgd gcc -g -O2 -
Wall -o .libs/perfparse-log2any perfparse_log2any-
perfparse-log2any.o perfparse_log2any-perfparse-
common.o
perfparse_log2any-log_reader.o perfparse_log2any-
storage.o -L/export/home/nagios/installed-
packages/perfparse-all/libpp_common
/export/home/nagios/installed-packages/perfparse-
all/libpp_common/.libs/libpp_common.so
-L/usr/local/lib -L/usr/lib -L/usr/local/ssl/lib -
L/usr/local/BerkeleyDB.4.2/lib -L/usr/openwin/lib -
L/export/home/nagios/installed-packages/perfparse-
all/libnagios_perfdata_parser

/export/home/nagios/installed-packages/perfparse-
all/libnagios_perfdata_parser/.libs/libnagios_perfdata
_parser.so
/usr/local/lib/libglib.so ../intl/libintl.a /usr/loca
l/lib/libiconv.so /usr/local/lib/libgd.so -lXpm -
lX11 /usr/local/lib/libjpeg.so /usr/local/lib/libfontc
onfig.so /usr/local/lib/libexpat.so /usr/local/lib/lib
freetype.so -lpng12 -lz -lm -
R/opt/asnmtap/perfparse/lib -R/usr/local/lib
Undefined first referenced
symbol in file
bind perfparse_log2any-
log_reader.o (symbol
belongs to implicit
dependency /usr/lib/libsocket.so.1)
dlsym perfparse_log2any-
storage.o (symbol
belongs to implicit dependency /usr/lib/libdl.so.1)
rpl_malloc perfparse_log2any-
log_reader.o
accept perfparse_log2any-
log_reader.o (symbol
belongs to implicit
dependency /usr/lib/libsocket.so.1)
dlopen perfparse_log2any-
storage.o (symbol
belongs to implicit dependency /usr/lib/libdl.so.1)
listen perfparse_log2any-
log_reader.o (symbol
belongs to implicit
dependency /usr/lib/libsocket.so.1)
gethostbyname perfparse_log2any-
log_reader.o (symbol
belongs to implicit dependency /usr/lib/libnsl.so.1)
socket perfparse_log2any-
log_reader.o (symbol
belongs to implicit
dependency /usr/lib/libsocket.so.1)
rpl_realloc perfparse_log2any-
log_reader.o
setsockopt perfparse_log2any-
log_reader.o (symbol
belongs to implicit
dependency /usr/lib/libsocket.so.1)
connect perfparse_log2any-
log_reader.o (symbol
belongs to implicit
dependency /usr/lib/libsocket.so.1)
dlerror perfparse_log2any-
storage.o (symbol
belongs to implicit dependency /usr/lib/libdl.so.1)
shutdown perfparse_log2any-
log_reader.o (symbol
belongs to implicit
dependency /usr/lib/libsocket.so.1)
ld: fatal: Symbol referencing errors. No output
written to .libs/perfparse-log2any
collect2: ld returned 1 exit status
make[2]: *** [perfparse-log2any] Error 1
make[2]: Leaving directory
`/export/home/nagios/installed-packages/perfparse-
all/perfparse'
make[1]: *** [all-recursive] Error 1
make[1]: Leaving directory
`/export/home/nagios/installed-packages/perfparse-all'
make: *** [all] Error 2

-- Alex Peeters

Discussion

  • Nobody/Anonymous

    Logged In: NO

    When do i get one answer PLEASE

    Onto the same machine i have:

    perfparse-0.105.6 and perfparse-0.106.1

    perfparse-0.105.6:
    ...
    Making all in contrib
    make[2]: Entering directory `/export/home/nagios/installed-packages/perfparse-0.105.6-asnmtap/contrib'
    make[2]: Nothing to be done for `all'.
    make[2]: Leaving directory `/export/home/nagios/installed-packages/perfparse-0.105.6-asnmtap/contrib'
    Making all in po
    make[2]: Entering directory `/export/home/nagios/installed-packages/perfparse-0.105.6-asnmtap/po'
    make[2]: Nothing to be done for `all'.
    make[2]: Leaving directory `/export/home/nagios/installed-packages/perfparse-0.105.6-asnmtap/po'
    Making all in scripts
    make[2]: Entering directory `/export/home/nagios/installed-packages/perfparse-0.105.6-asnmtap/scripts'
    rm -f perfparse.sh.example perfparse.sh.tmp
    sed -e 's,@bindir\@,/opt/asnmtap/perfparse/bin,g' -e 's,@sysconfdir\@,/opt/asnmtap/perfparse/etc,g' -e 's,@localstatedir\@,/opt/asnmtap/perfparse/var,g' -e 's,@prefix\@,/opt/asnmtap/perfparse,g' ./perfparse.sh.in >perfparse.sh.tmp
    chmod +x perfparse.sh.tmp
    mv perfparse.sh.tmp perfparse.sh.example

    perfparse-0.106.1:

    mkdir .libs
    gcc -g -O2 -Wall -o .libs/perfparse-log2any perfparse_log2any-perfparse-log2any.o perfparse_log2any-perfparse-common.o perfparse_log2any-log_reader.o perfparse_log2any-storage.o -L/export/home/nagios/installed-packages/perfparse-0.106.1/libpp_common /export/home/nagios/installed-packages/perfparse-0.106.1/libpp_common/.libs/libpp_common.so -L/usr/local/lib -L/usr/lib -L/usr/local/ssl/lib -L/usr/local/BerkeleyDB.4.2/lib -L/usr/openwin/lib -L/export/home/nagios/installed-packages/perfparse-0.106.1/libnagios_perfdata_parser /export/home/nagios/installed-packages/perfparse-0.106.1/libnagios_perfdata_parser/.libs/libnagios_perfdata_parser.so /usr/local/lib/libglib-2.0.so ../intl/libintl.a /usr/local/lib/libiconv.so /usr/local/lib/libgd.so -lXpm -lX11 /usr/local/lib/libjpeg.so /usr/local/lib/libfontconfig.so /usr/local/lib/libexpat.so /usr/local/lib/libfreetype.so -lpng12 -lz -lm -R/opt/asnmtap/perfparse/lib -R/usr/local/lib
    Undefined first referenced
    symbol in file
    bind perfparse_log2any-log_reader.o (symbol belongs to implicit dependency /usr/lib/libsocket.so.1)
    dlsym perfparse_log2any-storage.o (symbol belongs to implicit dependency /usr/lib/libdl.so.1)
    rpl_malloc perfparse_log2any-log_reader.o
    accept perfparse_log2any-log_reader.o (symbol belongs to implicit dependency /usr/lib/libsocket.so.1)
    dlopen perfparse_log2any-storage.o (symbol belongs to implicit dependency /usr/lib/libdl.so.1)
    listen perfparse_log2any-log_reader.o (symbol belongs to implicit dependency /usr/lib/libsocket.so.1)
    gethostbyname perfparse_log2any-log_reader.o (symbol belongs to implicit dependency /usr/lib/libnsl.so.1)
    socket perfparse_log2any-log_reader.o (symbol belongs to implicit dependency /usr/lib/libsocket.so.1)
    rpl_realloc perfparse_log2any-log_reader.o
    setsockopt perfparse_log2any-log_reader.o (symbol belongs to implicit dependency /usr/lib/libsocket.so.1)
    connect perfparse_log2any-log_reader.o (symbol belongs to implicit dependency /usr/lib/libsocket.so.1)
    dlerror perfparse_log2any-storage.o (symbol belongs to implicit dependency /usr/lib/libdl.so.1)
    shutdown perfparse_log2any-log_reader.o (symbol belongs to implicit dependency /usr/lib/libsocket.so.1)
    ld: fatal: Symbol referencing errors. No output written to .libs/perfparse-log2any
    collect2: ld returned 1 exit status
    make[2]: *** [perfparse-log2any] Error 1
    make[2]: Leaving directory `/export/home/nagios/installed-packages/perfparse-0.106.1/perfparse'
    make[1]: *** [all-recursive] Error 1
    make[1]: Leaving directory `/export/home/nagios/installed-packages/perfparse-0.106.1'
    make: *** [all] Error 2

     
  • Nobody/Anonymous

    Logged In: NO

    snapshot perfparse-all-07-05-03

    configure: Using glib2
    checking for what data source... ASNMTAP
    checking for what database to use... Mysql
    checking for your ability to administrate a database... you need more experience...
    checking for mysql_config... /usr/local/bin/mysql_config
    checking for gzopen in -lz... yes
    checking gd.h usability... yes
    checking gd.h presence... yes
    checking for gd.h... yes
    checking for gdlib-config... /usr/local/bin/gdlib-config
    checking for gdImageCreate in -lgd... yes
    checking for printw in -lncurses... no
    configure: error: ncurses development libraries not usable.
    Install ncurses development libraries and rerun configure.
    See config.log or FAQs for details.

     
  • Nobody/Anonymous

    Logged In: NO

    snapshot perfparse-all-07-05-03

    configure: Using glib2
    checking for what data source... ASNMTAP
    checking for what database to use... Mysql
    checking for your ability to administrate a database... you need more experience...
    checking for mysql_config... /usr/local/bin/mysql_config
    checking for gzopen in -lz... yes
    checking gd.h usability... yes
    checking gd.h presence... yes
    checking for gd.h... yes
    checking for gdlib-config... /usr/local/bin/gdlib-config
    checking for gdImageCreate in -lgd... yes
    checking for printw in -lncurses... no
    configure: error: ncurses development libraries not usable.
    Install ncurses development libraries and rerun configure.
    See config.log or FAQs for details.

     
  • Nobody/Anonymous

    Logged In: NO

    snapshot perfparse-all-07-05-03

    configure: Using glib2
    checking for what data source... ASNMTAP
    checking for what database to use... Mysql
    checking for your ability to administrate a database... you need more experience...
    checking for mysql_config... /usr/local/bin/mysql_config
    checking for gzopen in -lz... yes
    checking gd.h usability... yes
    checking gd.h presence... yes
    checking for gd.h... yes
    checking for gdlib-config... /usr/local/bin/gdlib-config
    checking for gdImageCreate in -lgd... yes
    checking for printw in -lncurses... no
    configure: error: ncurses development libraries not usable.
    Install ncurses development libraries and rerun configure.
    See config.log or FAQs for details.

     
  • Nobody/Anonymous

    Logged In: NO

    version 0.106.1 on solaris 9, where 0.105.6 compiles en works

    ../configure --prefix=/opt/asnmtap/perfparse
    --with-imagedir=/opt/asnmtap/applications/htmlroot/img/
    --with-cgidir=/opt/asnmtap/applications/htmlroot/cgi-bin
    --with-http_image_path=/asnmtap/img --with-data-source=asnmtap
    --disable-perfparse --disable-db_tools --disable-cgis

    mv perfparse.sh.tmp perfparse.sh.example
    make[2]: Leaving directory
    `/export/home/nagios/installed-packages/perfparse-0.106.1/scripts'
    make[2]: Entering directory
    `/export/home/nagios/installed-packages/perfparse-0.106.1'
    make[2]: Leaving directory
    `/export/home/nagios/installed-packages/perfparse-0.106.1'
    make[1]: Leaving directory
    `/export/home/nagios/installed-packages/perfparse-0.106.1'

    ---------------------------------------------------------------------------
    ------------------------------------------------------------

    LDFLAGS="-ldl -lsocket" ./configure --prefix=/opt/asnmtap/perfparse
    --with-imagedir=/opt/asnmtap/applications/htmlroot/img/
    --with-cgidir=/opt/asnmtap/applications/htmlroot/cgi-bin
    --with-http_image_path=/asnmtap/img --with-data-source=asnmtap

    mkdir .libs
    gcc -g -O2 -Wall -o .libs/perfparse-log2any
    perfparse_log2any-perfparse-log2any.o perfparse_log2any-perfparse-common.o
    perfparse_log2any-log_reader.o perfparse_log2any-storage.o
    -L/export/home/nagios/installed-packages/perfparse-0.106.1/libpp_common
    /export/home/nagios/installed-packages/perfparse-0.106.1
    /libpp_common/.libs/libpp_common.so -L/usr/local/lib -L/usr/lib
    -L/usr/local/ssl/lib -L/usr/local/BerkeleyDB.4.2/lib -L/usr/openwin/lib
    -L/export/home/nagios/installed-packages/perfparse-0.106.1
    /libnagios_perfdata_parser
    /export/home/nagios/installed-packages/perfparse-0.106.1
    /libnagios_perfdata_parser/.libs/libnagios_perfdata_parser.so -ldl -lsocket
    /usr/local/lib/libglib-2.0.so ../intl/libintl.a /usr/local/lib/libiconv.so
    /usr/local/lib/libgd.so -lXpm -lX11 /usr/local/lib/libjpeg.so
    /usr/local/lib/libfontconfig.so /usr/local/lib/libexpat.so
    /usr/local/lib/libfreetype.so -lpng12 -lz -lm -R/opt/asnmtap/perfparse/lib
    -R/usr/local/lib
    Undefined first referenced
    symbol in file
    rpl_malloc perfparse_log2any-log_reader.o
    gethostbyname perfparse_log2any-log_reader.o (symbol
    belongs to implicit dependency /usr/lib/libnsl.so.1)
    rpl_realloc perfparse_log2any-log_reader.o
    ld: fatal: Symbol referencing errors. No output written to
    ..libs/perfparse-log2any
    collect2: ld returned 1 exit status
    make[2]: *** [perfparse-log2any] Error 1
    make[2]: Leaving directory
    `/export/home/nagios/installed-packages/perfparse-0.106.1/perfparse'
    make[1]: *** [all-recursive] Error 1
    make[1]: Leaving directory
    `/export/home/nagios/installed-packages/perfparse-0.106.1'
    make: *** [all] Error 2

    ---------------------------------------------------------------------------
    ------------------------------------------------------------

    ../configure --prefix=/opt/asnmtap/perfparse
    --with-imagedir=/opt/asnmtap/applications/htmlroot/img/
    --with-cgidir=/opt/asnmtap/applications/htmlroot/cgi-bin
    --with-http_image_path=/asnmtap/img --with-data-source=asnmtap

    mkdir .libs
    gcc -g -O2 -Wall -o .libs/perfparse-log2any
    perfparse_log2any-perfparse-log2any.o perfparse_log2any-perfparse-common.o
    perfparse_log2any-log_reader.o perfparse_log2any-storage.o
    -L/export/home/nagios/installed-packages/perfparse-0.106.1/libpp_common
    /export/home/nagios/installed-packages/perfparse-0.106.1
    /libpp_common/.libs/libpp_common.so -L/usr/local/lib -L/usr/lib
    -L/usr/local/ssl/lib -L/usr/local/BerkeleyDB.4.2/lib -L/usr/openwin/lib
    -L/export/home/nagios/installed-packages/perfparse-0.106.1
    /libnagios_perfdata_parser
    /export/home/nagios/installed-packages/perfparse-0.106.1
    /libnagios_perfdata_parser/.libs/libnagios_perfdata_parser.so
    /usr/local/lib/libglib-2.0.so ../intl/libintl.a /usr/local/lib/libiconv.so
    /usr/local/lib/libgd.so -lXpm -lX11 /usr/local/lib/libjpeg.so
    /usr/local/lib/libfontconfig.so /usr/local/lib/libexpat.so
    /usr/local/lib/libfreetype.so -lpng12 -lz -lm -R/opt/asnmtap/perfparse/lib
    -R/usr/local/lib
    Undefined first referenced
    symbol in file
    bind perfparse_log2any-log_reader.o (symbol
    belongs to implicit dependency /usr/lib/libsocket.so.1)
    dlsym perfparse_log2any-storage.o (symbol
    belongs to implicit dependency /usr/lib/libdl.so.1)
    rpl_malloc perfparse_log2any-log_reader.o
    accept perfparse_log2any-log_reader.o (symbol
    belongs to implicit dependency /usr/lib/libsocket.so.1)
    dlopen perfparse_log2any-storage.o (symbol
    belongs to implicit dependency /usr/lib/libdl.so.1)
    listen perfparse_log2any-log_reader.o (symbol
    belongs to implicit dependency /usr/lib/libsocket.so.1)
    gethostbyname perfparse_log2any-log_reader.o (symbol
    belongs to implicit dependency /usr/lib/libnsl.so.1)
    socket perfparse_log2any-log_reader.o (symbol
    belongs to implicit dependency /usr/lib/libsocket.so.1)
    rpl_realloc perfparse_log2any-log_reader.o
    setsockopt perfparse_log2any-log_reader.o (symbol
    belongs to implicit dependency /usr/lib/libsocket.so.1)
    connect perfparse_log2any-log_reader.o (symbol
    belongs to implicit dependency /usr/lib/libsocket.so.1)
    dlerror perfparse_log2any-storage.o (symbol
    belongs to implicit dependency /usr/lib/libdl.so.1)
    shutdown perfparse_log2any-log_reader.o (symbol
    belongs to implicit dependency /usr/lib/libsocket.so.1)
    ld: fatal: Symbol referencing errors. No output written to
    ..libs/perfparse-log2any
    collect2: ld returned 1 exit status
    make[2]: *** [perfparse-log2any] Error 1
    make[2]: Leaving directory
    `/export/home/nagios/installed-packages/perfparse-0.106.1/perfparse'
    make[1]: *** [all-recursive] Error 1
    make[1]: Leaving directory
    `/export/home/nagios/installed-packages/perfparse-0.106.1'
    make: *** [all] Error 2

    ---------------------------------------------------------------------------
    ------------------------------------------------------------

    ../configure --prefix=/opt/asnmtap/perfparse
    --with-imagedir=/opt/asnmtap/applications/htmlroot/img/
    --with-cgidir=/opt/asnmtap/applications/htmlroot/cgi-bin
    --with-http_image_path=/asnmtap/img --with-data-source=asnmtap
    --disable-perfparse --disable-cgis

    mkdir .libs
    gcc -g -O2 -Wall -o .libs/perfparse-db-purge
    perfparse_db_purge-perfparse-db-purge.o perfparse_db_purge-convert.o
    -L/export/home/nagios/installed-packages/perfparse-0.106.1/libpp_mysql
    /export/home/nagios/installed-packages/perfparse-0.106.1
    /libpp_mysql/.libs/libpp_mysql.so -L/usr/local/lib -L/usr/lib
    -L/usr/local/ssl/lib -L/usr/local/BerkeleyDB.4.2/lib -L/usr/openwin/lib
    -L/usr/local/lib/mysql /usr/local/lib/mysql/libmysqlclient.so -lposix4
    -lgen -lsocket -lnsl
    -L/export/home/nagios/installed-packages/perfparse-0.106.1/libpp_common
    /export/home/nagios/installed-packages/perfparse-0.106.1
    /libpp_common/.libs/libpp_common.so /usr/local/lib/libglib-2.0.so
    .../intl/libintl.a /usr/local/lib/libiconv.so /usr/local/lib/libgd.so -lXpm
    -lX11 /usr/local/lib/libjpeg.so /usr/local/lib/libfontconfig.so
    /usr/local/lib/libexpat.so /usr/local/lib/libfreetype.so -lpng12 -lz -lm
    -R/opt/asnmtap/perfparse/lib -R/usr/local/lib/mysql -R/usr/local/lib
    Undefined first referenced
    symbol in file
    rpl_malloc ../intl/libintl.a(bindtextdom.o)
    rpl_realloc ../intl/libintl.a(dcigettext.o)
    ld: fatal: Symbol referencing errors. No output written to
    ..libs/perfparse-db-purge
    collect2: ld returned 1 exit status
    make[2]: *** [perfparse-db-purge] Error 1
    make[2]: Leaving directory
    `/export/home/nagios/installed-packages/perfparse-0.106.1/db_tools'
    make[1]: *** [all-recursive] Error 1
    make[1]: Leaving directory
    `/export/home/nagios/installed-packages/perfparse-0.106.1'
    make: *** [all] Error 2

    ---------------------------------------------------------------------------
    ------------------------------------------------------------

    ./configure --prefix=/opt/asnmtap/perfparse
    --with-imagedir=/opt/asnmtap/applications/htmlroot/img/
    --with-cgidir=/opt/asnmtap/applications/htmlroot/cgi-bin
    --with-http_image_path=/asnmtap/img --with-data-source=asnmtap
    --disable-perfparse --disable-db_tools

    mkdir .libs
    gcc -g -O2 -Wall -o .libs/perfparse.cgi perfparse_cgi-perfgraph.o
    perfparse_cgi-cgi.o perfparse_cgi-cgi_bin_report.o
    perfparse_cgi-cgi_del_policy.o perfparse_cgi-cgi_bin_summary_policy.o
    perfparse_cgi-cgi_graph.o perfparse_cgi-cgi_host_groups.o
    perfparse_cgi-cgi_intro.o perfparse_cgi-cgi_raw_report.o
    perfparse_cgi-cgi_select_object.o perfparse_cgi-object_users.o
    -L/export/home/nagios/installed-packages/perfparse-0.106.1/libpp_mysql
    /export/home/nagios/installed-packages/perfparse-0.106.1
    /libpp_mysql/.libs/libpp_mysql.so -L/usr/local/lib -L/usr/lib
    -L/usr/local/ssl/lib -L/usr/local/BerkeleyDB.4.2/lib -L/usr/openwin/lib
    -L/usr/local/lib/mysql /usr/local/lib/mysql/libmysqlclient.so -lposix4
    -lgen -lsocket -lnsl
    -L/export/home/nagios/installed-packages/perfparse-0.106.1/libpp_common
    /export/home/nagios/installed-packages/perfparse-0.106.1
    /libpp_common/.libs/libpp_common.so /usr/local/lib/libglib-2.0.so
    .../intl/libintl.a /usr/local/lib/libiconv.so /usr/local/lib/libgd.so -lXpm
    -lX11 /usr/local/lib/libjpeg.so /usr/local/lib/libfontconfig.so
    /usr/local/lib/libexpat.so /usr/local/lib/libfreetype.so -lpng12 -lz -lm
    -R/opt/asnmtap/perfparse/lib -R/usr/local/lib/mysql -R/usr/local/lib
    ld: warning: symbol `sTo' has differing sizes:
    (file perfparse_cgi-cgi_bin_report.o value=0x16; file
    perfparse_cgi-cgi_graph.o value=0x1e);
    perfparse_cgi-cgi_graph.o definition taken
    ld: warning: symbol `sFrom' has differing sizes:
    (file perfparse_cgi-cgi_bin_report.o value=0x16; file
    perfparse_cgi-cgi_graph.o value=0x1e);
    perfparse_cgi-cgi_graph.o definition taken
    ld: warning: symbol `sTo' has differing sizes:
    (file perfparse_cgi-cgi_graph.o value=0x1e; file
    perfparse_cgi-cgi_raw_report.o value=0x16);
    perfparse_cgi-cgi_graph.o definition taken
    ld: warning: symbol `sFrom' has differing sizes:
    (file perfparse_cgi-cgi_graph.o value=0x1e; file
    perfparse_cgi-cgi_raw_report.o value=0x16);
    perfparse_cgi-cgi_graph.o definition taken
    ld: warning: symbol `sTimeRange' has differing sizes:
    (file perfparse_cgi-cgi_graph.o value=0x4; file
    perfparse_cgi-cgi_raw_report.o value=0x2);
    perfparse_cgi-cgi_graph.o definition taken
    Undefined first referenced
    symbol in file
    rpl_malloc perfparse_cgi-cgi.o
    rpl_realloc ../intl/libintl.a(dcigettext.o)
    ld: fatal: Symbol referencing errors. No output written to
    ..libs/perfparse.cgi
    collect2: ld returned 1 exit status
    make[2]: *** [perfparse.cgi] Error 1
    make[2]: Leaving directory
    `/export/home/nagios/installed-packages/perfparse-0.106.1/cgi'
    make[1]: *** [all-recursive] Error 1
    make[1]: Leaving directory
    `/export/home/nagios/installed-packages/perfparse-0.106.1'
    make: *** [all] Error 2

    ---------------------------------------------------------------------------
    ------------------------------------------------------------

    ../configure --prefix=/opt/asnmtap/perfparse
    --with-imagedir=/opt/asnmtap/applications/htmlroot/img/
    --with-cgidir=/opt/asnmtap/applications/htmlroot/cgi-bin
    --with-http_image_path=/asnmtap/img --with-data-source=asnmtap
    --disable-db_tools --disable-cgis

    mkdir .libs
    gcc -g -O2 -Wall -o .libs/perfparse-log2any
    perfparse_log2any-perfparse-log2any.o perfparse_log2any-perfparse-common.o
    perfparse_log2any-log_reader.o perfparse_log2any-storage.o
    -L/export/home/nagios/installed-packages/perfparse-0.106.1/libpp_common
    /export/home/nagios/installed-packages/perfparse-0.106.1
    /libpp_common/.libs/libpp_common.so -L/usr/local/lib -L/usr/lib
    -L/usr/local/ssl/lib -L/usr/local/BerkeleyDB.4.2/lib -L/usr/openwin/lib
    -L/export/home/nagios/installed-packages/perfparse-0.106.1
    /libnagios_perfdata_parser
    /export/home/nagios/installed-packages/perfparse-0.106.1
    /libnagios_perfdata_parser/.libs/libnagios_perfdata_parser.so
    /usr/local/lib/libglib-2.0.so ../intl/libintl.a /usr/local/lib/libiconv.so
    /usr/local/lib/libgd.so -lXpm -lX11 /usr/local/lib/libjpeg.so
    /usr/local/lib/libfontconfig.so /usr/local/lib/libexpat.so
    /usr/local/lib/libfreetype.so -lpng12 -lz -lm -R/opt/asnmtap/perfparse/lib
    -R/usr/local/lib
    Undefined first referenced
    symbol in file
    bind perfparse_log2any-log_reader.o (symbol
    belongs to implicit dependency /usr/lib/libsocket.so.1)
    dlsym perfparse_log2any-storage.o (symbol
    belongs to implicit dependency /usr/lib/libdl.so.1)
    rpl_malloc perfparse_log2any-log_reader.o
    accept perfparse_log2any-log_reader.o (symbol
    belongs to implicit dependency /usr/lib/libsocket.so.1)
    dlopen perfparse_log2any-storage.o (symbol
    belongs to implicit dependency /usr/lib/libdl.so.1)
    listen perfparse_log2any-log_reader.o (symbol
    belongs to implicit dependency /usr/lib/libsocket.so.1)
    gethostbyname perfparse_log2any-log_reader.o (symbol
    belongs to implicit dependency /usr/lib/libnsl.so.1)
    socket perfparse_log2any-log_reader.o (symbol
    belongs to implicit dependency /usr/lib/libsocket.so.1)
    rpl_realloc perfparse_log2any-log_reader.o
    setsockopt perfparse_log2any-log_reader.o (symbol
    belongs to implicit dependency /usr/lib/libsocket.so.1)
    connect perfparse_log2any-log_reader.o (symbol
    belongs to implicit dependency /usr/lib/libsocket.so.1)
    dlerror perfparse_log2any-storage.o (symbol
    belongs to implicit dependency /usr/lib/libdl.so.1)
    shutdown perfparse_log2any-log_reader.o (symbol
    belongs to implicit dependency /usr/lib/libsocket.so.1)
    ld: fatal: Symbol referencing errors. No output written to
    ..libs/perfparse-log2any
    collect2: ld returned 1 exit status
    make[2]: *** [perfparse-log2any] Error 1
    make[2]: Leaving directory
    `/export/home/nagios/installed-packages/perfparse-0.106.1/perfparse'
    make[1]: *** [all-recursive] Error 1
    make[1]: Leaving directory
    `/export/home/nagios/installed-packages/perfparse-0.106.1'
    make: *** [all] Error 2

     

Log in to post a comment.