Menu ▾ ▴

#2 make ERROR

open
nobody
None
5
2002-11-05
2002-11-05
Anonymous
No

I've got an error on my suse 8.0 system.
./configure -> OK
make:
...
In file included from searchquery.h:22,
from searchquery.cpp:18:
query.h:92: syntax error before `;'
searchquery.cpp: In method `void
SearchQuery::listedFiles(KIO::Job *, const
KIO::UDSEntryList &)':
searchquery.cpp:231: `class FinderQuery' has no member
named `time'
searchquery.cpp:233: `class FinderQuery' has no member
named `time'
searchquery.cpp:235: `class FinderQuery' has no member
named `time'
searchquery.cpp:237: `class FinderQuery' has no member
named `time'
searchquery.cpp:239: `class FinderQuery' has no member
named `time'
make[3]: *** [searchquery.o] Fehler 1
make[3]: Verlassen des Verzeichnisses Verzeichnis
ť/opt/software/pcmm-1.0/pcmm/pfinderŤ
make[2]: *** [all-recursive] Fehler 1
make[2]: Verlassen des Verzeichnisses Verzeichnis
ť/opt/software/pcmm-1.0/pcmmŤ
make[1]: *** [all-recursive] Fehler 1
make[1]: Verlassen des Verzeichnisses Verzeichnis
ť/opt/software/pcmm-1.0Ť
make: *** [all] Fehler 2

Discussion

  • Nobody/Anonymous

    Logged In: NO

    I have the same problem on Slackware 8.1

     
  • Nobody/Anonymous

    Logged In: NO

    I finally succeed to compile it.
    I just had added #include <time.h> (in query.h and in some
    other files)
    and #include <stdlib.h> in an other file (because getenv
    could not be found)

     

Log in to post a comment.