#464 Problem compiling gabber 0.8.8

important
open
nobody
None
5
2003-11-13
2003-11-13
Pierre
No

[...]
Making all in src
gmake[2]: Entering directory `/tmp/gabber-0.8.8/src'
source='BaseGabberWindow.cc'
object='BaseGabberWindow.o' libtool=no \ depfile='.deps/BaseGabberWindow.Po'
tmpdepfile='.deps/BaseGabberWindow.TPo' \ depmode=gcc3 /bin/sh ../depcomp \ g++ -s -DHAVE_CONFIG_H -I. -I. -I.. -I..
-I../jabberoo/libjudo/src/expat
-I../jabberoo/libjudo/src -I../jabberoo/include
-I/usr/local/include/libglade-1.0
-I/usr/local/include/gnome-xml -DXML_USE_BUFFER_CONTENT
-I/usr/local/include/gnome-1.0 -DNEED_GNOMESUPPORT_H
-I/usr/local/lib/gnome-libs/include
-I/usr/local/include/gtk-1.2
-I/usr/local/include/glib-1.2
-I/usr/local/lib/glib/include
-I/usr/local/lib/gnomemm/include -I/usr/local/include
-I/usr/local/include/orbit-1.0
-I/usr/local/lib/sigc++-1.0/include
-I/usr/local/include/sigc++-1.0
-I/usr/local/lib/gtkmm/include
-I/usr/local/include/gal-1.0
-I/usr/local/include/gdk-pixbuf-1.0
-I/usr/local/include/freetype2 -I/usr/local/include
-I/usr/local/include/xmms -I/usr/local/include/gtk-1.2
-I/usr/local/include/glib-1.2
-I/usr/local/lib/glib/include -DWITH_SSL
-DOPENSSL_NO_KRB5 -DG_LOG_DOMAIN=\"Gabber\"
-DGNOMELOCALEDIR=\""/usr/local/share/locale"\"
-DDATADIR=\"/usr/local/share\" -I../intl
-I/usr/local/BerkeleyDB.4.1/include
-I/usr/local/include/gtk-1.2
-I/usr/local/include/glib-1.2
-I/usr/local/lib/glib/include -O3 -march=i686 -Wall
-Wno-unused -s -c -o BaseGabberWindow.o `test -f
'BaseGabberWindow.cc' || echo './'`BaseGabberWindow.cc
In file included from BaseGabberWindow.cc:22:
GladeHelper.hh: In function `T* getWidgetPtr(GladeXML*,
const char*) [with T =
Gtk::Button]':
BaseGabberWindow.hh:74: instantiated from here
GladeHelper.hh:33: error: `cerr' undeclared (first use
this function)
GladeHelper.hh:33: error: (Each undeclared identifier
is reported only once for
each function it appears in.)
GladeHelper.hh:33: error: `endl' undeclared (first use
this function)
gmake[2]: *** [BaseGabberWindow.o] Error 1
gmake[2]: Leaving directory `/tmp/gabber-0.8.8/src'
gmake[1]: *** [all-recursive] Error 1
gmake[1]: Leaving directory `/tmp/gabber-0.8.8'
gmake: *** [all] Error 2

Discussion


Log in to post a comment.