|
From: Friedrich L. <fl...@fl...> - 2002-05-02 20:57:24
|
Hi! I just did a fresh install of the build system and now I can't build because wvstreams makes troubles. executing wvstreams with option build (in /data/build/tmp/wvstreams-3.70) patching file src/Makefile make[1]: Entering directory `/data/build/tmp/wvstreams-3.70' --> Making all in /data/build/tmp/wvstreams-3.70/src... [ -e ../wvrules.mk ] && ln -s ../wvrules.mk . rm -rf include mkdir include.new cd include.new && for d in utils streams configfile ipstreams crypto; do ln -s ../$d/*.h .; done mv include.new include --> Making all in /data/build/tmp/wvstreams-3.70/src/utils... g++ $_R_CXXFLAGS -c base64.cc g++ $_R_CXXFLAGS -c verstring.cc g++ $_R_CXXFLAGS -c strutils.cc g++ $_R_CXXFLAGS -c strcrypt.cc g++ $_R_CXXFLAGS -c wvstring.cc g++ $_R_CXXFLAGS -c wvstringlist.cc g++ $_R_CXXFLAGS -c wvstringtable.cc g++ $_R_CXXFLAGS -c wvlinklist.cc g++ $_R_CXXFLAGS -c wvhashtable.cc g++ $_R_CXXFLAGS -c wvsorter.cc g++ $_R_CXXFLAGS -c wvbuffer.cc g++ $_R_CXXFLAGS -c wvtask.cc g++ $_R_CXXFLAGS -c wvfork.cc g++ $_R_CXXFLAGS -c wvsubproc.cc g++ $_R_CXXFLAGS -c wvencoder.cc g++ $_R_CXXFLAGS -c wvgzip.cc wvgzip.cc:8: zlib.h: No such file or directory make[3]: *** [wvgzip.o] Error 1 make[2]: *** [utils] Error 2 make[1]: *** [src] Error 2 make[1]: Leaving directory `/data/build/tmp/wvstreams-3.70' make: *** [iso] Error 1 -- MfG / Regards Friedrich Lobenstock |