|
From: Serge L. <se...@nn...> - 2004-09-30 05:31:40
|
Dear Heiko. I CVS'ed yesterday. make mrproper , unpack, prepare, build > executing compartment with option build (in /data/build/tmp/compartment) > > executing coreutils with option build (in /data/build/tmp/coreutils-5.2.1) > ERROR > /data/build/scripts/coreutils build failed > check log file /data/build/tmp/LOGS/build/coreutils for details > make: *** [build] Error 1 > vi /data/build/tmp/LOGS/build/coreutils > gcc -g -O2 -o whoami whoami.o ../lib/libfetish.a ../lib/libfetish.a > if gcc -DHAVE_CONFIG_H -I. -I. -I.. -I.. -I. -I../lib -I../lib -g -O2 -MT yes.o -MD -MP -MF ".deps/yes.Tpo" -c -o yes.o yes.c; \ > then mv -f ".deps/yes.Tpo" ".deps/yes.Po"; else rm -f ".deps/yes.Tpo"; exit 1; fi > gcc -g -O2 -o yes yes.o ../lib/libfetish.a ../lib/libfetish.a > if gcc -DHAVE_CONFIG_H -I. -I. -I.. -I.. -I. -I../lib -I../lib -g -O2 -MT uname.o -MD -MP -MF ".deps/uname.Tpo" -c -o uname.o uname.c; \ > then mv -f ".deps/uname.Tpo" ".deps/uname.Po"; else rm -f ".deps/uname.Tpo"; exit 1; fi > uname.c: In function `main': > uname.c:364: warning: initialization discards qualifiers from pointer target type > uname.c:276: error: can't find a register in class `BREG' while reloading `asm' > uname.c:277: error: can't find a register in class `BREG' while reloading `asm' > make[4]: *** [uname.o] Error 1 > make[4]: Leaving directory `/build/tmp/coreutils-5.2.1/src' > make[3]: *** [all] Error 2 > make[3]: Leaving directory `/build/tmp/coreutils-5.2.1/src' > make[2]: *** [all-recursive] Error 1 > make[2]: Leaving directory `/build/tmp/coreutils-5.2.1' > make[1]: *** [all] Error 2 > make[1]: Leaving directory `/build/tmp/coreutils-5.2.1' -- Best regards, Serge mailto:se...@nn... |