|
From: Heiko Z. <he...@zu...> - 2003-12-21 04:06:37
|
Diego Torres wrote: >is this problem known? > >lm75.c:28:18: lm75.h: No such file or directory >lm75.c: In function `lm75_temp': >lm75.c:286: warning: implicit declaration of function `LM75_TEMP_FROM_REG' >lm75.c:292: warning: implicit declaration of function `LM75_TEMP_TO_REG' >make[3]: *** [lm75.o] Error 1 >make[3]: Leaving directory `/data/build/tmp/linux-2.4.23/drivers/sensors' >make[2]: *** [_modsubdir_sensors] Error 2 >make[2]: Leaving directory `/data/build/tmp/linux-2.4.23/drivers' >make[1]: *** [_mod_drivers] Error 2 >make[1]: Leaving directory `/data/build/tmp/linux-2.4.23' >ERROR >/data/build/scripts/linux build failed >check log file for details >make: *** [build] Error 1 > > > Yes it is know, this is a problem of v2.8.2 As a temporary fix just copy lm75.h to include/linux The lmsensors team is inform, I expect the next release to be "fixed". Heiko |