|
From: Diego T. <dt...@co...> - 2003-12-21 03:23:14
|
is this problem known? lm75.c:28:18: lm75.h: No such file or directory lm75.c: In function `lm75_temp': lm75.c:286: warning: implicit declaration of function `LM75_TEMP_FROM_REG' lm75.c:292: warning: implicit declaration of function `LM75_TEMP_TO_REG' make[3]: *** [lm75.o] Error 1 make[3]: Leaving directory `/data/build/tmp/linux-2.4.23/drivers/sensors' make[2]: *** [_modsubdir_sensors] Error 2 make[2]: Leaving directory `/data/build/tmp/linux-2.4.23/drivers' make[1]: *** [_mod_drivers] Error 2 make[1]: Leaving directory `/data/build/tmp/linux-2.4.23' ERROR /data/build/scripts/linux build failed check log file for details make: *** [build] Error 1 -- -- gnupg keyfingerprint -- 48AF 5BF9 8F54 2966 64CC 2327 7CD0 DD91 B09D 5799 -- Use of a keyboard or mouse may be linked to serious injuries or disorders. Diego Torres - dtorres at anthalia dot org - Madrid / España |