You can subscribe to this list here.
| 2001 |
Jan
|
Feb
|
Mar
|
Apr
|
May
|
Jun
|
Jul
|
Aug
|
Sep
(55) |
Oct
(44) |
Nov
(156) |
Dec
(123) |
|---|---|---|---|---|---|---|---|---|---|---|---|---|
| 2002 |
Jan
(130) |
Feb
(156) |
Mar
(162) |
Apr
(171) |
May
(97) |
Jun
(127) |
Jul
(58) |
Aug
(81) |
Sep
(86) |
Oct
(45) |
Nov
(41) |
Dec
(84) |
| 2003 |
Jan
(71) |
Feb
(87) |
Mar
(133) |
Apr
(152) |
May
(151) |
Jun
(232) |
Jul
(320) |
Aug
(237) |
Sep
(271) |
Oct
(536) |
Nov
(301) |
Dec
(393) |
| 2004 |
Jan
(393) |
Feb
(184) |
Mar
(314) |
Apr
(225) |
May
(139) |
Jun
(77) |
Jul
(87) |
Aug
(75) |
Sep
(139) |
Oct
(50) |
Nov
(8) |
Dec
(28) |
| 2005 |
Jan
(66) |
Feb
(63) |
Mar
(14) |
Apr
(14) |
May
(8) |
Jun
(23) |
Jul
(21) |
Aug
(6) |
Sep
(29) |
Oct
(55) |
Nov
(38) |
Dec
(8) |
| 2006 |
Jan
(5) |
Feb
(10) |
Mar
(1) |
Apr
(15) |
May
(32) |
Jun
(44) |
Jul
(11) |
Aug
(8) |
Sep
(9) |
Oct
(14) |
Nov
(4) |
Dec
(3) |
| 2007 |
Jan
(3) |
Feb
(3) |
Mar
(2) |
Apr
|
May
|
Jun
|
Jul
(35) |
Aug
(49) |
Sep
(8) |
Oct
(42) |
Nov
(44) |
Dec
(7) |
| 2008 |
Jan
(2) |
Feb
(7) |
Mar
(8) |
Apr
(80) |
May
(74) |
Jun
(29) |
Jul
(5) |
Aug
(7) |
Sep
(6) |
Oct
(1) |
Nov
|
Dec
|
| 2009 |
Jan
(8) |
Feb
(19) |
Mar
(3) |
Apr
(24) |
May
(22) |
Jun
(23) |
Jul
(8) |
Aug
(23) |
Sep
(8) |
Oct
(27) |
Nov
(52) |
Dec
(27) |
| 2010 |
Jan
(36) |
Feb
(29) |
Mar
(17) |
Apr
(28) |
May
(21) |
Jun
(4) |
Jul
|
Aug
(28) |
Sep
(18) |
Oct
(6) |
Nov
(34) |
Dec
(16) |
| 2011 |
Jan
(18) |
Feb
(12) |
Mar
|
Apr
|
May
(9) |
Jun
(1) |
Jul
(5) |
Aug
(5) |
Sep
(7) |
Oct
(16) |
Nov
(26) |
Dec
(17) |
| 2012 |
Jan
(6) |
Feb
(34) |
Mar
(52) |
Apr
(10) |
May
(3) |
Jun
|
Jul
|
Aug
(1) |
Sep
|
Oct
(4) |
Nov
(1) |
Dec
(4) |
| 2013 |
Jan
(5) |
Feb
|
Mar
|
Apr
(5) |
May
(4) |
Jun
|
Jul
|
Aug
(14) |
Sep
|
Oct
|
Nov
|
Dec
|
| 2014 |
Jan
|
Feb
(2) |
Mar
(5) |
Apr
|
May
|
Jun
|
Jul
|
Aug
|
Sep
|
Oct
|
Nov
(3) |
Dec
(11) |
| 2015 |
Jan
(5) |
Feb
|
Mar
|
Apr
|
May
|
Jun
|
Jul
|
Aug
(1) |
Sep
(1) |
Oct
(1) |
Nov
|
Dec
|
| 2016 |
Jan
|
Feb
|
Mar
|
Apr
|
May
|
Jun
(2) |
Jul
|
Aug
|
Sep
|
Oct
|
Nov
|
Dec
|
| 2017 |
Jan
(1) |
Feb
|
Mar
|
Apr
|
May
|
Jun
|
Jul
|
Aug
|
Sep
|
Oct
|
Nov
|
Dec
|
| 2018 |
Jan
(2) |
Feb
|
Mar
|
Apr
|
May
|
Jun
|
Jul
|
Aug
|
Sep
|
Oct
|
Nov
|
Dec
|
|
From: SourceForge.net <no...@so...> - 2004-09-10 23:24:41
|
Bugs item #1023342, was opened at 2004-09-06 17:50 Message generated for change (Settings changed) made by smiley73 You can respond by visiting: https://sourceforge.net/tracker/?func=detail&atid=410643&aid=1023342&group_id=34096 Category: Base System Group: v1.3 >Status: Closed >Resolution: Fixed Priority: 5 Submitted By: Heiko Zuerker (smiley73) >Assigned to: Heiko Zuerker (smiley73) Summary: replace iputils Initial Comment: project isn't maintained anymore, switch to inetutils or similar. ---------------------------------------------------------------------- You can respond by visiting: https://sourceforge.net/tracker/?func=detail&atid=410643&aid=1023342&group_id=34096 |
|
From: SourceForge.net <no...@so...> - 2004-09-10 23:24:05
|
Bugs item #1024102, was opened at 2004-09-07 20:52 Message generated for change (Comment added) made by smiley73 You can respond by visiting: https://sourceforge.net/tracker/?func=detail&atid=410643&aid=1024102&group_id=34096 Category: Base System Group: v1.3 >Status: Closed >Resolution: Works For Me Priority: 5 Submitted By: Heiko Zuerker (smiley73) >Assigned to: Heiko Zuerker (smiley73) Summary: lilo doesn't compile in 1.3 Initial Comment: we probably should remove it anyway. grub and syslinux should be enough ---------------------------------------------------------------------- >Comment By: Heiko Zuerker (smiley73) Date: 2004-09-10 18:24 Message: Logged In: YES user_id=112133 removed lilo, we don't need it anyway ---------------------------------------------------------------------- You can respond by visiting: https://sourceforge.net/tracker/?func=detail&atid=410643&aid=1024102&group_id=34096 |
|
From: SourceForge.net <no...@so...> - 2004-09-10 23:23:39
|
Bugs item #1024816, was opened at 2004-09-08 21:02 Message generated for change (Comment added) made by smiley73 You can respond by visiting: https://sourceforge.net/tracker/?func=detail&atid=410643&aid=1024816&group_id=34096 Category: Base System Group: v1.3 >Status: Closed >Resolution: Works For Me Priority: 5 Submitted By: Heiko Zuerker (smiley73) >Assigned to: Heiko Zuerker (smiley73) Summary: sysklogd doesn't compile in 1.3 Initial Comment: /usr/include/linux/module.h:249: error: field `list' has incomplete type /usr/include/linux/module.h:300: error: field `modules_which_use_me' has incomplete type /usr/include/linux/module.h: In function `__module_get': /usr/include/linux/module.h:370: error: invalid type argument of `->' /usr/include/linux/module.h:370: error: invalid type argument of `->' /usr/include/linux/module.h:371: error: invalid type argument of `->' /usr/include/linux/module.h:371: error: `TIF_NEED_RESCHED' undeclared (first use in this function) /usr/include/linux/module.h: In function `try_module_get': /usr/include/linux/module.h:380: error: invalid type argument of `->' /usr/include/linux/module.h:380: error: invalid type argument of `->' /usr/include/linux/module.h:385: error: invalid type argument of `->' /usr/include/linux/module.h:385: error: `TIF_NEED_RESCHED' undeclared (first use in this function) /usr/include/linux/module.h: In function `module_put': /usr/include/linux/module.h:393: error: invalid type argument of `->' /usr/include/linux/module.h:393: error: invalid type argument of `->' /usr/include/linux/module.h:398: error: invalid type argument of `->' /usr/include/linux/module.h:398: error: `TIF_NEED_RESCHED' undeclared (first use in this function) ksym_mod.c: At top level: ksym_mod.c:98: warning: "struct kernel_sym" declared inside parameter list ksym_mod.c:98: warning: its scope is only this definition or declaration, which is probably not what you want ksym_mod.c:140: error: field `module_info' has incomplete type ksym_mod.c:209: confused by earlier errors, bailing out make[1]: *** [ksym_mod.o] Error 1 make[1]: Leaving directory `/data/build/tmp/sysklogd-1.4.1' ---------------------------------------------------------------------- >Comment By: Heiko Zuerker (smiley73) Date: 2004-09-10 18:23 Message: Logged In: YES user_id=112133 removed sysklogd ---------------------------------------------------------------------- You can respond by visiting: https://sourceforge.net/tracker/?func=detail&atid=410643&aid=1024816&group_id=34096 |
|
From: SourceForge.net <no...@so...> - 2004-09-10 23:08:08
|
Bugs item #884161, was opened at 2004-01-25 09:52 Message generated for change (Comment added) made by smiley73 You can respond by visiting: https://sourceforge.net/tracker/?func=detail&atid=410643&aid=884161&group_id=34096 Category: Package Group: v1.1 >Status: Closed >Resolution: Fixed Priority: 5 Submitted By: Heiko Zuerker (smiley73) >Assigned to: Heiko Zuerker (smiley73) Summary: python fails with kernel 2.6 Initial Comment: /bin/install -c -m 644 pyconfig.h /data/build/tmp/Python-install/usr/include/python2.3/pyconfig.h case $MAKEFLAGS in *-s*) CC='i586-pc-linux-gnu-gcc -pthread' LDSHARED='i586-pc-linux-gnu-gcc -pthread -shared' OPT='-DNDEBUG -g -O3 -Wall -Wstrict-prototypes' ./python -E ./setup.py -q build;; *) CC='i586-pc-linux-gnu-gcc -pthread' LDSHARED='i586-pc-linux-gnu-gcc -pthread -shared' OPT='-DNDEBUG -g -O3 -Wall -Wstrict-prototypes' ./python -E ./setup.py build;; esac running build running build_ext running build_scripts Creating directory /data/build/tmp/Python-install/usr/lib/python2.3/config /bin/install -c -m 644 Modules/config.c /data/build/tmp/Python-install/usr/lib/python2.3/config/config.c /bin/install -c -m 644 Modules/python.o /data/build/tmp/Python-install/usr/lib/python2.3/config/python.o /bin/install -c -m 644 ./Modules/config.c.in /data/build/tmp/Python-install/usr/lib/python2.3/config/config.c.in /bin/install -c -m 644 Makefile /data/build/tmp/Python-install/usr/lib/python2.3/config/Makefile /bin/install -c -m 644 Modules/Setup /data/build/tmp/Python-install/usr/lib/python2.3/config/Setup /bin/install -c -m 644 Modules/Setup.local /data/build/tmp/Python-install/usr/lib/python2.3/config/Setup.local /bin/install -c -m 644 Modules/Setup.config /data/build/tmp/Python-install/usr/lib/python2.3/config/Setup.config /bin/install -c ./Modules/makesetup /data/build/tmp/Python-install/usr/lib/python2.3/config/makesetup /bin/install -c ./install-sh /data/build/tmp/Python-install/usr/lib/python2.3/config/install-sh ./python -E ./setup.py install --prefix=/data/build/tmp/Python-install/usr --install-scripts=/data/build/tmp/Python-install/usr/bin --install-platlib=/data/build/tmp/Python-install/usr/lib/python2.3/lib-dynload --root=/ running install running build running build_ext running build_scripts running install_lib creating /data/build/tmp/Python-install/usr/lib/python2.3/lib-dynload copying build/lib.linux-i686-2.3/_testcapi.so -> /data/build/tmp/Python-install/usr/lib/python2.3/lib-dynload error: /data/build/tmp/Python-install/usr/lib/python2.3/lib-dynload/_testcapi.so: Function not implemented make[1]: *** [sharedinstall] Error 1 make[1]: Leaving directory `/data/build/tmp/Python-2.3.3' ---------------------------------------------------------------------- >Comment By: Heiko Zuerker (smiley73) Date: 2004-09-10 18:08 Message: Logged In: YES user_id=112133 new version compiles fine ---------------------------------------------------------------------- Comment By: Heiko Zuerker (smiley73) Date: 2004-01-31 11:01 Message: Logged In: YES user_id=112133 using the old kernel headers didn't help, let's wait for the next python version ---------------------------------------------------------------------- You can respond by visiting: https://sourceforge.net/tracker/?func=detail&atid=410643&aid=884161&group_id=34096 |
|
From: SourceForge.net <no...@so...> - 2004-09-10 13:50:44
|
Bugs item #1025868, was opened at 2004-09-10 08:50 Message generated for change (Tracker Item Submitted) made by Item Submitter You can respond by visiting: https://sourceforge.net/tracker/?func=detail&atid=410643&aid=1025868&group_id=34096 Category: Base System Group: v1.3 Status: Open Resolution: None Priority: 5 Submitted By: Heiko Zuerker (smiley73) Assigned to: Nobody/Anonymous (nobody) Summary: replace devfs with udev Initial Comment: devfs is marked as obsolete in kernel 2.6 but there are config files for udev, which can simulate the devfs behavior which should make a transistion easier ---------------------------------------------------------------------- You can respond by visiting: https://sourceforge.net/tracker/?func=detail&atid=410643&aid=1025868&group_id=34096 |
|
From: SourceForge.net <no...@so...> - 2004-09-10 00:17:19
|
Bugs item #1025488, was opened at 2004-09-09 19:16 Message generated for change (Settings changed) made by smiley73 You can respond by visiting: https://sourceforge.net/tracker/?func=detail&atid=410643&aid=1025488&group_id=34096 Category: Package Group: v1.3 >Status: Deleted >Resolution: Duplicate Priority: 5 Submitted By: Heiko Zuerker (smiley73) Assigned to: Nobody/Anonymous (nobody) Summary: ipsec-tools don't compile with gcc 3.4.x Initial Comment: reported to maintainer ./include-glibc -I../include-glibc -include ./../include-glibc/glibc-bugs.h -DINET6 -DIPV6_INRIA_VERSION -I./missing -Wall -Werror -Wno-unused -DYIPS_DEBU G -DIPSEC -I. -I. -DSYSCONFDIR=\/etc/ipsec-tools\ -Wno-sign-compare -DYY_NO_UNPUT -I./../libipsec -c logger.c gcc -g -O2 -I./../include-glibc -I../include-glibc -include ./../include-glibc/glibc-bugs.h -DINET6 -DIPV6_INRIA_VERSION -I./missing -DHAVE_CONFIG_H -I./. ./include-glibc -I../include-glibc -include ./../include-glibc/glibc-bugs.h -DINET6 -DIPV6_INRIA_VERSION -I./missing -Wall -Werror -Wno-unused -DYIPS_DEBU G -DIPSEC -I. -I. -DSYSCONFDIR=\/etc/ipsec-tools\ -Wno-sign-compare -DYY_NO_UNPUT -I./../libipsec -c schedule.c gcc -g -O2 -I./../include-glibc -I../include-glibc -include ./../include-glibc/glibc-bugs.h -DINET6 -DIPV6_INRIA_VERSION -I./missing -DHAVE_CONFIG_H -I./. ./include-glibc -I../include-glibc -include ./../include-glibc/glibc-bugs.h -DINET6 -DIPV6_INRIA_VERSION -I./missing -Wall -Werror -Wno-unused -DYIPS_DEBU G -DIPSEC -I. -I. -DSYSCONFDIR=\/etc/ipsec-tools\ -Wno-sign-compare -DYY_NO_UNPUT -I./../libipsec -c str2val.c gcc -g -O2 -I./../include-glibc -I../include-glibc -include ./../include-glibc/glibc-bugs.h -DINET6 -DIPV6_INRIA_VERSION -I./missing -DHAVE_CONFIG_H -I./. ./include-glibc -I../include-glibc -include ./../include-glibc/glibc-bugs.h -DINET6 -DIPV6_INRIA_VERSION -I./missing -Wall -Werror -Wno-unused -DYIPS_DEBU G -DIPSEC -I. -I. -DSYSCONFDIR=\/etc/ipsec-tools\ -Wno-sign-compare -DYY_NO_UNPUT -I./../libipsec -c misc.c gcc -g -O2 -I./../include-glibc -I../include-glibc -include ./../include-glibc/glibc-bugs.h -DINET6 -DIPV6_INRIA_VERSION -I./missing -DHAVE_CONFIG_H -I./. ./include-glibc -I../include-glibc -include ./../include-glibc/glibc-bugs.h -DINET6 -DIPV6_INRIA_VERSION -I./missing -Wall -Werror -Wno-unused -DYIPS_DEBU G -DIPSEC -I. -I. -DSYSCONFDIR=\/etc/ipsec-tools\ -Wno-sign-compare -DYY_NO_UNPUT -I./../libipsec -c sockmisc.c sockmisc.c: In function `saddrwop2str': sockmisc.c:837: warning: null argument where non-null required (arg 1) make[4]: *** [sockmisc.o] Error 1 make[4]: Leaving directory `/data/build/tmp/ipsec-tools-0.4b1/src/racoon' make[3]: *** [all-recursive] Error 1 make[3]: Leaving directory `/data/build/tmp/ipsec-tools-0.4b1/src' make[2]: *** [all-recursive] Error 1 make[2]: Leaving directory `/data/build/tmp/ipsec-tools-0.4b1' make[1]: *** [all] Error 2 make[1]: Leaving directory `/data/build/tmp/ipsec-tools-0.4b1' + exit 1 ---------------------------------------------------------------------- You can respond by visiting: https://sourceforge.net/tracker/?func=detail&atid=410643&aid=1025488&group_id=34096 |
|
From: SourceForge.net <no...@so...> - 2004-09-10 00:16:35
|
Bugs item #1025488, was opened at 2004-09-09 19:16 Message generated for change (Tracker Item Submitted) made by Item Submitter You can respond by visiting: https://sourceforge.net/tracker/?func=detail&atid=410643&aid=1025488&group_id=34096 Category: Package Group: v1.3 Status: Open Resolution: None Priority: 5 Submitted By: Heiko Zuerker (smiley73) Assigned to: Nobody/Anonymous (nobody) Summary: ipsec-tools don't compile with gcc 3.4.x Initial Comment: reported to maintainer ./include-glibc -I../include-glibc -include ./../include-glibc/glibc-bugs.h -DINET6 -DIPV6_INRIA_VERSION -I./missing -Wall -Werror -Wno-unused -DYIPS_DEBU G -DIPSEC -I. -I. -DSYSCONFDIR=\/etc/ipsec-tools\ -Wno-sign-compare -DYY_NO_UNPUT -I./../libipsec -c logger.c gcc -g -O2 -I./../include-glibc -I../include-glibc -include ./../include-glibc/glibc-bugs.h -DINET6 -DIPV6_INRIA_VERSION -I./missing -DHAVE_CONFIG_H -I./. ./include-glibc -I../include-glibc -include ./../include-glibc/glibc-bugs.h -DINET6 -DIPV6_INRIA_VERSION -I./missing -Wall -Werror -Wno-unused -DYIPS_DEBU G -DIPSEC -I. -I. -DSYSCONFDIR=\/etc/ipsec-tools\ -Wno-sign-compare -DYY_NO_UNPUT -I./../libipsec -c schedule.c gcc -g -O2 -I./../include-glibc -I../include-glibc -include ./../include-glibc/glibc-bugs.h -DINET6 -DIPV6_INRIA_VERSION -I./missing -DHAVE_CONFIG_H -I./. ./include-glibc -I../include-glibc -include ./../include-glibc/glibc-bugs.h -DINET6 -DIPV6_INRIA_VERSION -I./missing -Wall -Werror -Wno-unused -DYIPS_DEBU G -DIPSEC -I. -I. -DSYSCONFDIR=\/etc/ipsec-tools\ -Wno-sign-compare -DYY_NO_UNPUT -I./../libipsec -c str2val.c gcc -g -O2 -I./../include-glibc -I../include-glibc -include ./../include-glibc/glibc-bugs.h -DINET6 -DIPV6_INRIA_VERSION -I./missing -DHAVE_CONFIG_H -I./. ./include-glibc -I../include-glibc -include ./../include-glibc/glibc-bugs.h -DINET6 -DIPV6_INRIA_VERSION -I./missing -Wall -Werror -Wno-unused -DYIPS_DEBU G -DIPSEC -I. -I. -DSYSCONFDIR=\/etc/ipsec-tools\ -Wno-sign-compare -DYY_NO_UNPUT -I./../libipsec -c misc.c gcc -g -O2 -I./../include-glibc -I../include-glibc -include ./../include-glibc/glibc-bugs.h -DINET6 -DIPV6_INRIA_VERSION -I./missing -DHAVE_CONFIG_H -I./. ./include-glibc -I../include-glibc -include ./../include-glibc/glibc-bugs.h -DINET6 -DIPV6_INRIA_VERSION -I./missing -Wall -Werror -Wno-unused -DYIPS_DEBU G -DIPSEC -I. -I. -DSYSCONFDIR=\/etc/ipsec-tools\ -Wno-sign-compare -DYY_NO_UNPUT -I./../libipsec -c sockmisc.c sockmisc.c: In function `saddrwop2str': sockmisc.c:837: warning: null argument where non-null required (arg 1) make[4]: *** [sockmisc.o] Error 1 make[4]: Leaving directory `/data/build/tmp/ipsec-tools-0.4b1/src/racoon' make[3]: *** [all-recursive] Error 1 make[3]: Leaving directory `/data/build/tmp/ipsec-tools-0.4b1/src' make[2]: *** [all-recursive] Error 1 make[2]: Leaving directory `/data/build/tmp/ipsec-tools-0.4b1' make[1]: *** [all] Error 2 make[1]: Leaving directory `/data/build/tmp/ipsec-tools-0.4b1' + exit 1 ---------------------------------------------------------------------- You can respond by visiting: https://sourceforge.net/tracker/?func=detail&atid=410643&aid=1025488&group_id=34096 |
|
From: SourceForge.net <no...@so...> - 2004-09-09 22:06:19
|
Bugs item #1025440, was opened at 2004-09-09 17:06 Message generated for change (Tracker Item Submitted) made by Item Submitter You can respond by visiting: https://sourceforge.net/tracker/?func=detail&atid=410643&aid=1025440&group_id=34096 Category: Package Group: v1.3 Status: Open Resolution: None Priority: 5 Submitted By: Heiko Zuerker (smiley73) Assigned to: Nobody/Anonymous (nobody) Summary: ipsec-tools don't compile with gcc 3.4.x Initial Comment: reported to maintainer ./include-glibc -I../include-glibc -include ./../include-glibc/glibc-bugs.h -DINET6 -DIPV6_INRIA_VERSION -I./missing -Wall -Werror -Wno-unused -DYIPS_DEBU G -DIPSEC -I. -I. -DSYSCONFDIR=\/etc/ipsec-tools\ -Wno-sign-compare -DYY_NO_UNPUT -I./../libipsec -c logger.c gcc -g -O2 -I./../include-glibc -I../include-glibc -include ./../include-glibc/glibc-bugs.h -DINET6 -DIPV6_INRIA_VERSION -I./missing -DHAVE_CONFIG_H -I./. ./include-glibc -I../include-glibc -include ./../include-glibc/glibc-bugs.h -DINET6 -DIPV6_INRIA_VERSION -I./missing -Wall -Werror -Wno-unused -DYIPS_DEBU G -DIPSEC -I. -I. -DSYSCONFDIR=\/etc/ipsec-tools\ -Wno-sign-compare -DYY_NO_UNPUT -I./../libipsec -c schedule.c gcc -g -O2 -I./../include-glibc -I../include-glibc -include ./../include-glibc/glibc-bugs.h -DINET6 -DIPV6_INRIA_VERSION -I./missing -DHAVE_CONFIG_H -I./. ./include-glibc -I../include-glibc -include ./../include-glibc/glibc-bugs.h -DINET6 -DIPV6_INRIA_VERSION -I./missing -Wall -Werror -Wno-unused -DYIPS_DEBU G -DIPSEC -I. -I. -DSYSCONFDIR=\/etc/ipsec-tools\ -Wno-sign-compare -DYY_NO_UNPUT -I./../libipsec -c str2val.c gcc -g -O2 -I./../include-glibc -I../include-glibc -include ./../include-glibc/glibc-bugs.h -DINET6 -DIPV6_INRIA_VERSION -I./missing -DHAVE_CONFIG_H -I./. ./include-glibc -I../include-glibc -include ./../include-glibc/glibc-bugs.h -DINET6 -DIPV6_INRIA_VERSION -I./missing -Wall -Werror -Wno-unused -DYIPS_DEBU G -DIPSEC -I. -I. -DSYSCONFDIR=\/etc/ipsec-tools\ -Wno-sign-compare -DYY_NO_UNPUT -I./../libipsec -c misc.c gcc -g -O2 -I./../include-glibc -I../include-glibc -include ./../include-glibc/glibc-bugs.h -DINET6 -DIPV6_INRIA_VERSION -I./missing -DHAVE_CONFIG_H -I./. ./include-glibc -I../include-glibc -include ./../include-glibc/glibc-bugs.h -DINET6 -DIPV6_INRIA_VERSION -I./missing -Wall -Werror -Wno-unused -DYIPS_DEBU G -DIPSEC -I. -I. -DSYSCONFDIR=\/etc/ipsec-tools\ -Wno-sign-compare -DYY_NO_UNPUT -I./../libipsec -c sockmisc.c sockmisc.c: In function `saddrwop2str': sockmisc.c:837: warning: null argument where non-null required (arg 1) make[4]: *** [sockmisc.o] Error 1 make[4]: Leaving directory `/data/build/tmp/ipsec-tools-0.4b1/src/racoon' make[3]: *** [all-recursive] Error 1 make[3]: Leaving directory `/data/build/tmp/ipsec-tools-0.4b1/src' make[2]: *** [all-recursive] Error 1 make[2]: Leaving directory `/data/build/tmp/ipsec-tools-0.4b1' make[1]: *** [all] Error 2 make[1]: Leaving directory `/data/build/tmp/ipsec-tools-0.4b1' + exit 1 ---------------------------------------------------------------------- You can respond by visiting: https://sourceforge.net/tracker/?func=detail&atid=410643&aid=1025440&group_id=34096 |
|
From: SourceForge.net <no...@so...> - 2004-09-09 21:46:18
|
Bugs item #1023968, was opened at 2004-09-07 15:30 Message generated for change (Comment added) made by smiley73 You can respond by visiting: https://sourceforge.net/tracker/?func=detail&atid=410643&aid=1023968&group_id=34096 Category: Package >Group: v1.3 >Status: Closed >Resolution: Fixed Priority: 5 Submitted By: Heiko Zuerker (smiley73) >Assigned to: Heiko Zuerker (smiley73) Summary: ebtables doesn't compile with gcc3.4.1 Initial Comment: reported the problem to the ebtables mailinglist ---------------------------------------------------------------------- >Comment By: Heiko Zuerker (smiley73) Date: 2004-09-09 16:30 Message: Logged In: YES user_id=112133 received patch from maintainer ---------------------------------------------------------------------- You can respond by visiting: https://sourceforge.net/tracker/?func=detail&atid=410643&aid=1023968&group_id=34096 |
|
From: SourceForge.net <no...@so...> - 2004-09-09 18:04:58
|
Bugs item #1025305, was opened at 2004-09-09 13:04 Message generated for change (Tracker Item Submitted) made by Item Submitter You can respond by visiting: https://sourceforge.net/tracker/?func=detail&atid=410643&aid=1025305&group_id=34096 Category: Package Group: v1.3 Status: Open Resolution: None Priority: 5 Submitted By: Heiko Zuerker (smiley73) Assigned to: Nobody/Anonymous (nobody) Summary: l2ptd doesn't compile in 1.3 Initial Comment: make[1]: Entering directory `/data/build/tmp/l2tpd-0.69' cc -g -O2 -DDEBUG_PPPD -DDEBUG_CONTROL -DDEBUG_ENTROPY -Wall -DSANITY -DLINUX -DIP_ALLOCATION -c -o l2tpd.o l2tpd.c In file included from l2tp.h:28, from l2tpd.c:42: misc.h:67: warning: conflicting types for built-in function 'log' cc -g -O2 -DDEBUG_PPPD -DDEBUG_CONTROL -DDEBUG_ENTROPY -Wall -DSANITY -DLINUX -DIP_ALLOCATION -c -o pty.o pty.c In file included from l2tp.h:28, from pty.c:17: misc.h:67: warning: conflicting types for built-in function 'log' cc -g -O2 -DDEBUG_PPPD -DDEBUG_CONTROL -DDEBUG_ENTROPY -Wall -DSANITY -DLINUX -DIP_ALLOCATION -c -o misc.o misc.c In file included from l2tp.h:28, from misc.c:30: misc.h:67: warning: conflicting types for built-in function 'log' cc -g -O2 -DDEBUG_PPPD -DDEBUG_CONTROL -DDEBUG_ENTROPY -Wall -DSANITY -DLINUX -DIP_ALLOCATION -c -o control.o control.c In file included from l2tp.h:28, from control.c:23: misc.h:67: warning: conflicting types for built-in function 'log' control.c: In function `handle_packet': control.c:1664: warning: unused variable `tv' cc -g -O2 -DDEBUG_PPPD -DDEBUG_CONTROL -DDEBUG_ENTROPY -Wall -DSANITY -DLINUX -DIP_ALLOCATION -c -o avp.o avp.c In file included from l2tp.h:28, from avp.c:19: misc.h:67: warning: conflicting types for built-in function 'log' avp.c: In function `handle_avps': avp.c:1612: error: parse error before "__FUNCTION__" make[1]: *** [avp.o] Error 1 make[1]: Leaving directory `/data/build/tmp/l2tpd-0.69' ---------------------------------------------------------------------- You can respond by visiting: https://sourceforge.net/tracker/?func=detail&atid=410643&aid=1025305&group_id=34096 |
|
From: SourceForge.net <no...@so...> - 2004-09-09 13:15:44
|
Bugs item #1024096, was opened at 2004-09-07 20:40 Message generated for change (Comment added) made by smiley73 You can respond by visiting: https://sourceforge.net/tracker/?func=detail&atid=410643&aid=1024096&group_id=34096 Category: Package Group: v1.3 >Status: Closed >Resolution: Fixed Priority: 5 Submitted By: Heiko Zuerker (smiley73) >Assigned to: Heiko Zuerker (smiley73) Summary: lcd4linux doesn't compile with gcc 3.4.1 Initial Comment: reported problem to maintainer make[1]: Entering directory `/data/build/tmp/lcd4linux-0.9.11' gcc -DHAVE_CONFIG_H -I. -I. -I. -D_GNU_SOURCE -Wall -g -O2 -c lcd4linux.c gcc -DHAVE_CONFIG_H -I. -I. -I. -D_GNU_SOURCE -Wall -g -O2 -c debug.c gcc -DHAVE_CONFIG_H -I. -I. -I. -D_GNU_SOURCE -Wall -g -O2 -c cfg.c gcc -DHAVE_CONFIG_H -I. -I. -I. -D_GNU_SOURCE -Wall -g -O2 -c lock.c gcc -DHAVE_CONFIG_H -I. -I. -I. -D_GNU_SOURCE -Wall -g -O2 -c pid.c gcc -DHAVE_CONFIG_H -I. -I. -I. -D_GNU_SOURCE -Wall -g -O2 -c parser.c gcc -DHAVE_CONFIG_H -I. -I. -I. -D_GNU_SOURCE -Wall -g -O2 -c processor.c gcc -DHAVE_CONFIG_H -I. -I. -I. -D_GNU_SOURCE -Wall -g -O2 -c system.c In file included from /usr/include/linux/ppp_defs.h:45, from /usr/include/net/ppp_defs.h:8, from /usr/include/net/if_ppp.h:56, from system.c:219: /usr/include/linux/crc-ccitt.h:6: error: syntax error before "const" /usr/include/linux/crc-ccitt.h:8: error: parse error before "crc_ccitt" /usr/include/linux/crc-ccitt.h:8: error: parse error before "crc" /usr/include/linux/crc-ccitt.h:10: error: parse error before "crc_ccitt_byte" /usr/include/linux/crc-ccitt.h:10: error: parse error before "crc" /usr/include/linux/crc-ccitt.h: In function `crc_ccitt_byte': /usr/include/linux/crc-ccitt.h:12: error: `crc' undeclared (first use in this function) /usr/include/linux/crc-ccitt.h:12: error: (Each undeclared identifier is reported only once /usr/include/linux/crc-ccitt.h:12: error: for each function it appears in.) /usr/include/linux/crc-ccitt.h:12: error: `c' undeclared (first use in this function) make[1]: *** [system.o] Error 1 make[1]: Leaving directory `/data/build/tmp/lcd4linux-0.9.11' ( ---------------------------------------------------------------------- >Comment By: Heiko Zuerker (smiley73) Date: 2004-09-09 08:15 Message: Logged In: YES user_id=112133 a patch for the kernel crc-ccitt.h was needed ---------------------------------------------------------------------- You can respond by visiting: https://sourceforge.net/tracker/?func=detail&atid=410643&aid=1024096&group_id=34096 |
|
From: SourceForge.net <no...@so...> - 2004-09-09 13:15:21
|
Bugs item #1024804, was opened at 2004-09-08 20:30 Message generated for change (Comment added) made by smiley73 You can respond by visiting: https://sourceforge.net/tracker/?func=detail&atid=410643&aid=1024804&group_id=34096 Category: Package Group: v1.3 >Status: Deleted >Resolution: Fixed Priority: 5 Submitted By: Heiko Zuerker (smiley73) >Assigned to: Heiko Zuerker (smiley73) Summary: portslave doesn't compile in 1.3 Initial Comment: make[1]: Entering directory `/data/build/tmp/portslave-2002.01.19' chmod 755 extract_and_patch ./extract_and_patch make -C src make[2]: Entering directory `/data/build/tmp/portslave-2002.01.19/src' gcc -O2 -Wall -W -Wshadow -Wpointer-arith -Wwrite-strings -pedantic -I../ppp-2.4.1/pppd -fPIC -DPIC -c -o libpsr_pic.o libpsr.c In file included from /usr/include/linux/ppp_defs.h:45, from /usr/include/net/ppp_defs.h:8, from ../ppp-2.4.1/pppd/pppd.h:57, from libpsr.c:15: /usr/include/linux/crc-ccitt.h:6: error: syntax error before "const" /usr/include/linux/crc-ccitt.h:8: error: parse error before "crc_ccitt" /usr/include/linux/crc-ccitt.h:8: error: parse error before "crc" /usr/include/linux/crc-ccitt.h:8: error: ISO C forbids data definition with no type or storage class /usr/include/linux/crc-ccitt.h:10: error: parse error before "crc_ccitt_byte" /usr/include/linux/crc-ccitt.h:10: error: parse error before "crc" /usr/include/linux/crc-ccitt.h: In function `crc_ccitt_byte': /usr/include/linux/crc-ccitt.h:12: error: `crc' undeclared (first use in this function) /usr/include/linux/crc-ccitt.h:12: error: (Each undeclared identifier is reported only once / ---------------------------------------------------------------------- >Comment By: Heiko Zuerker (smiley73) Date: 2004-09-09 08:15 Message: Logged In: YES user_id=112133 a patch for the kernel crc-ccitt.h was needed ---------------------------------------------------------------------- You can respond by visiting: https://sourceforge.net/tracker/?func=detail&atid=410643&aid=1024804&group_id=34096 |
|
From: Heiko Z. <he...@zu...> - 2004-09-09 13:08:47
|
Bruce Smith wrote: >>Summary: ... doesn't compile in 1.3 >> >> > >Maybe it'd be easier to list the ones that DO compile instead? :-) > > yeah yeah .... Actually most packages compile fine. ;-) -- Regards Heiko Zuerker http://www.devil-linux.org |
|
From: Bruce S. <bw...@ar...> - 2004-09-09 03:17:31
|
> Summary: ... doesn't compile in 1.3 Maybe it'd be easier to list the ones that DO compile instead? :-) - BS |
|
From: SourceForge.net <no...@so...> - 2004-09-09 02:02:51
|
Bugs item #1024816, was opened at 2004-09-08 21:02 Message generated for change (Tracker Item Submitted) made by Item Submitter You can respond by visiting: https://sourceforge.net/tracker/?func=detail&atid=410643&aid=1024816&group_id=34096 Category: Base System Group: v1.3 Status: Open Resolution: None Priority: 5 Submitted By: Heiko Zuerker (smiley73) Assigned to: Nobody/Anonymous (nobody) Summary: sysklogd doesn't compile in 1.3 Initial Comment: /usr/include/linux/module.h:249: error: field `list' has incomplete type /usr/include/linux/module.h:300: error: field `modules_which_use_me' has incomplete type /usr/include/linux/module.h: In function `__module_get': /usr/include/linux/module.h:370: error: invalid type argument of `->' /usr/include/linux/module.h:370: error: invalid type argument of `->' /usr/include/linux/module.h:371: error: invalid type argument of `->' /usr/include/linux/module.h:371: error: `TIF_NEED_RESCHED' undeclared (first use in this function) /usr/include/linux/module.h: In function `try_module_get': /usr/include/linux/module.h:380: error: invalid type argument of `->' /usr/include/linux/module.h:380: error: invalid type argument of `->' /usr/include/linux/module.h:385: error: invalid type argument of `->' /usr/include/linux/module.h:385: error: `TIF_NEED_RESCHED' undeclared (first use in this function) /usr/include/linux/module.h: In function `module_put': /usr/include/linux/module.h:393: error: invalid type argument of `->' /usr/include/linux/module.h:393: error: invalid type argument of `->' /usr/include/linux/module.h:398: error: invalid type argument of `->' /usr/include/linux/module.h:398: error: `TIF_NEED_RESCHED' undeclared (first use in this function) ksym_mod.c: At top level: ksym_mod.c:98: warning: "struct kernel_sym" declared inside parameter list ksym_mod.c:98: warning: its scope is only this definition or declaration, which is probably not what you want ksym_mod.c:140: error: field `module_info' has incomplete type ksym_mod.c:209: confused by earlier errors, bailing out make[1]: *** [ksym_mod.o] Error 1 make[1]: Leaving directory `/data/build/tmp/sysklogd-1.4.1' ---------------------------------------------------------------------- You can respond by visiting: https://sourceforge.net/tracker/?func=detail&atid=410643&aid=1024816&group_id=34096 |
|
From: SourceForge.net <no...@so...> - 2004-09-09 02:01:22
|
Bugs item #1024815, was opened at 2004-09-08 21:01 Message generated for change (Tracker Item Submitted) made by Item Submitter You can respond by visiting: https://sourceforge.net/tracker/?func=detail&atid=410643&aid=1024815&group_id=34096 Category: Package Group: v1.3 Status: Open Resolution: None Priority: 5 Submitted By: Heiko Zuerker (smiley73) Assigned to: Nobody/Anonymous (nobody) Summary: squidguard doesn't compile in 1.3 Initial Comment: checking for working const... yes checking for size_t... yes checking whether struct tm is in sys/time.h or time.h... time.h checking for regcomp... no configure: error: No regcomp library function. ---------------------------------------------------------------------- You can respond by visiting: https://sourceforge.net/tracker/?func=detail&atid=410643&aid=1024815&group_id=34096 |
|
From: SourceForge.net <no...@so...> - 2004-09-09 01:31:02
|
Bugs item #1024804, was opened at 2004-09-08 20:30 Message generated for change (Tracker Item Submitted) made by Item Submitter You can respond by visiting: https://sourceforge.net/tracker/?func=detail&atid=410643&aid=1024804&group_id=34096 Category: Package Group: v1.3 Status: Open Resolution: None Priority: 5 Submitted By: Heiko Zuerker (smiley73) Assigned to: Nobody/Anonymous (nobody) Summary: portslave doesn't compile in 1.3 Initial Comment: make[1]: Entering directory `/data/build/tmp/portslave-2002.01.19' chmod 755 extract_and_patch ./extract_and_patch make -C src make[2]: Entering directory `/data/build/tmp/portslave-2002.01.19/src' gcc -O2 -Wall -W -Wshadow -Wpointer-arith -Wwrite-strings -pedantic -I../ppp-2.4.1/pppd -fPIC -DPIC -c -o libpsr_pic.o libpsr.c In file included from /usr/include/linux/ppp_defs.h:45, from /usr/include/net/ppp_defs.h:8, from ../ppp-2.4.1/pppd/pppd.h:57, from libpsr.c:15: /usr/include/linux/crc-ccitt.h:6: error: syntax error before "const" /usr/include/linux/crc-ccitt.h:8: error: parse error before "crc_ccitt" /usr/include/linux/crc-ccitt.h:8: error: parse error before "crc" /usr/include/linux/crc-ccitt.h:8: error: ISO C forbids data definition with no type or storage class /usr/include/linux/crc-ccitt.h:10: error: parse error before "crc_ccitt_byte" /usr/include/linux/crc-ccitt.h:10: error: parse error before "crc" /usr/include/linux/crc-ccitt.h: In function `crc_ccitt_byte': /usr/include/linux/crc-ccitt.h:12: error: `crc' undeclared (first use in this function) /usr/include/linux/crc-ccitt.h:12: error: (Each undeclared identifier is reported only once / ---------------------------------------------------------------------- You can respond by visiting: https://sourceforge.net/tracker/?func=detail&atid=410643&aid=1024804&group_id=34096 |
|
From: Heiko Z. <he...@zu...> - 2004-09-08 19:43:22
|
Diego Torres wrote: >On Wed, Sep 08, 2004 at 03:19:54PM -0400, Heiko Zuerker wrote: > > > >>I also just got an email that a new version of loop-aes was released. >> >> > > please, upload and check that there is only one version of loop-aes > laying on the ftp, and that the .diff is also uploaded and bzip'ed... > > done -- Regards Heiko Zuerker http://www.devil-linux.org |
|
From: Diego T. <dt...@co...> - 2004-09-08 19:29:22
|
On Wed, Sep 08, 2004 at 03:19:54PM -0400, Heiko Zuerker wrote: > I also just got an email that a new version of loop-aes was released. please, upload and check that there is only one version of loop-aes laying on the ftp, and that the .diff is also uploaded and bzip'ed... -- -- gnupg keyfingerprint -- 48AF 5BF9 8F54 2966 64CC 2327 7CD0 DD91 B09D 5799 -- Use of a keyboard or mouse may be linked to serious injuries or disorders. Diego Torres - dtorres at anthalia dot org - Madrid / España |
|
From: Heiko Z. <he...@zu...> - 2004-09-08 19:25:32
|
Frank Pieczynski wrote: >Hello, >I tried to compile 1.2 CVS from 7th of September on my dual Opteron system. >The compilation stops in loop-AES. > > > Ah wait a minute.... Dual Opteron ? Some packages detect in different ways which system they run on, so I guess loop-AES recognizes the 'wrong' one. >executing loop-AES with option build (in /build/tmp/loop-AES-v2.1b) >ERROR >/build/scripts/loop-AES build failed >check log file /build/tmp/LOGS/build/loop-AES for details >make: *** [build] Error 1 > >interesting message inside "loop.o not for this architecture", the whole log >file is attached. > >Note I was able to compile a 1.0 long time ago and also a 1.2b1 on this >machine. > >Additionally I had a problem in documentation: >http://www.devil-linux.org/documentation/1.2.x/ch03s02.html >There is stated "make build install prepare iso dist" >But 'make build' fails, after I used m'make prepare' at first, it works. > >Regards >Frank > > >------------------------------------------------------------------------ > >make[1]: Entering directory `/build/tmp/loop-AES-v2.1b' >cd /build/tmp/linux-2.4.27 && make SUBDIRS=/build/tmp/loop-AES-v2.1b modules Q='@cd /build/tmp/loop-AES-v2.1b && if [ "$@" = "modules" ]; then make modules; fi; # ' >make[2]: Entering directory `/build/tmp/linux-2.4.27' >make -C /build/tmp/loop-AES-v2.1b CFLAGS="-D__KERNEL__ -I/build/tmp/linux-2.4.27/include -Wall -Wstrict-prototypes -Wno-trigraphs -O2 -fno-strict-aliasing -fno-common -fomit-frame-pointer -pipe -mpreferred-stack-boundary=2 -march=i586 -DMODULE -DMODVERSIONS -include /build/tmp/linux-2.4.27/include/linux/modversions.h" MAKING_MODULES=1 modules >make[3]: Entering directory `/build/tmp/loop-AES-v2.1b' >rm -f *.o *.ko *.orig *.rej *.mod.c patched-loop.[ch] test-file[1234] >rm -f -r test-dir1 tmp-d-kbuild >rm -f patched-loop.[ch] >cp loop.c-2.4.patched patched-loop.c >gcc -D__KERNEL__ -I/build/tmp/linux-2.4.27/include -Wall -Wstrict-prototypes -Wno-trigraphs -O2 -fno-strict-aliasing -fno-common -fomit-frame-pointer -pipe -mpreferred-stack-boundary=2 -march=i586 -DMODULE -DMODVERSIONS -include /build/tmp/linux-2.4.27/include/linux/modversions.h -nostdinc -iwithprefix include -DPENTIUM_ASM -DKBUILD_BASENAME=patched_loop -DKBUILD_MODNAME=loop -DEXPORT_SYMTAB -c patched-loop.c -o patched-loop.o >gcc -D__KERNEL__ -I/build/tmp/linux-2.4.27/include -Wall -Wstrict-prototypes -Wno-trigraphs -O2 -fno-strict-aliasing -fno-common -fomit-frame-pointer -pipe -mpreferred-stack-boundary=2 -march=i586 -DMODULE -DMODVERSIONS -include /build/tmp/linux-2.4.27/include/linux/modversions.h -nostdinc -iwithprefix include -DPENTIUM_ASM -DKBUILD_BASENAME=glue -DKBUILD_MODNAME=loop -c glue.c -o glue.o >gcc -D__ASSEMBLY__ -D__KERNEL__ -I/build/tmp/linux-2.4.27/include -c aes-i586.S -o aes-i586.o >gcc -D__ASSEMBLY__ -D__KERNEL__ -I/build/tmp/linux-2.4.27/include -c md5-i586.S -o md5-i586.o >ld -m elf_i386 -r patched-loop.o glue.o aes-i586.o md5-i586.o -o loop.o >mkdir -p /build/tmp/loop-AES-v2.1b/lib/modules/2.4.27-grsec/block >cp -p loop.o /build/tmp/loop-AES-v2.1b/lib/modules/2.4.27-grsec/block >rm -f /build/tmp/loop-AES-v2.1b/lib/modules/2.4.27-grsec/kernel/drivers/block/loop.{,k}o >/sbin/depmod -a -b /build/tmp/loop-AES-v2.1b -F /build/tmp/linux-2.4.27/System.map 2.4.27-grsec >depmod: ELF file /build/tmp/loop-AES-v2.1b/lib/modules/2.4.27-grsec/block/loop.o not for this architecture >make[3]: *** [modules] Error 1 >make[3]: Leaving directory `/build/tmp/loop-AES-v2.1b' >make[2]: *** [_mod_/build/tmp/loop-AES-v2.1b] Error 2 >make[2]: Leaving directory `/build/tmp/linux-2.4.27' >make[1]: *** [all] Error 2 >make[1]: Leaving directory `/build/tmp/loop-AES-v2.1b' > > -- Regards Heiko Zuerker http://www.devil-linux.org |
|
From: Heiko Z. <he...@zu...> - 2004-09-08 19:18:24
|
Diego Torres wrote: >On Wed, Sep 08, 2004 at 02:32:43PM -0400, Heiko Zuerker wrote: > > >>>/build/scripts/loop-AES build failed >>>check log file /build/tmp/LOGS/build/loop-AES for details >>>make: *** [build] Error 1 >>> >>> >>> >>Diego ? >> >> > >looks like a problem between loop-aes and a grsec patched kernel, >because i can compile it without problems under a clean kernel. > >what cpu did you configure on the makemenuconfig option? > > I also just got an email that a new version of loop-aes was released. -- Regards Heiko Zuerker http://www.devil-linux.org |
|
From: Diego T. <dt...@co...> - 2004-09-08 18:55:11
|
On Wed, Sep 08, 2004 at 02:32:43PM -0400, Heiko Zuerker wrote: > >/build/scripts/loop-AES build failed > >check log file /build/tmp/LOGS/build/loop-AES for details > >make: *** [build] Error 1 > > > Diego ? looks like a problem between loop-aes and a grsec patched kernel, because i can compile it without problems under a clean kernel. what cpu did you configure on the makemenuconfig option? -- -- gnupg keyfingerprint -- 48AF 5BF9 8F54 2966 64CC 2327 7CD0 DD91 B09D 5799 -- Use of a keyboard or mouse may be linked to serious injuries or disorders. Diego Torres - dtorres at anthalia dot org - Madrid / España |
|
From: Heiko Z. <he...@zu...> - 2004-09-08 18:31:15
|
Frank Pieczynski wrote: >Hello, >I tried to compile 1.2 CVS from 7th of September on my dual Opteron system. >The compilation stops in loop-AES. > >executing loop-AES with option build (in /build/tmp/loop-AES-v2.1b) >ERROR >/build/scripts/loop-AES build failed >check log file /build/tmp/LOGS/build/loop-AES for details >make: *** [build] Error 1 > > Diego ? >interesting message inside "loop.o not for this architecture", the whole log >file is attached. > >Note I was able to compile a 1.0 long time ago and also a 1.2b1 on this >machine. > >Additionally I had a problem in documentation: >http://www.devil-linux.org/documentation/1.2.x/ch03s02.html >There is stated "make build install prepare iso dist" >But 'make build' fails, after I used m'make prepare' at first, it works. > > I corrected it in the docs. >Regards >Frank > > >------------------------------------------------------------------------ > >make[1]: Entering directory `/build/tmp/loop-AES-v2.1b' >cd /build/tmp/linux-2.4.27 && make SUBDIRS=/build/tmp/loop-AES-v2.1b modules Q='@cd /build/tmp/loop-AES-v2.1b && if [ "$@" = "modules" ]; then make modules; fi; # ' >make[2]: Entering directory `/build/tmp/linux-2.4.27' >make -C /build/tmp/loop-AES-v2.1b CFLAGS="-D__KERNEL__ -I/build/tmp/linux-2.4.27/include -Wall -Wstrict-prototypes -Wno-trigraphs -O2 -fno-strict-aliasing -fno-common -fomit-frame-pointer -pipe -mpreferred-stack-boundary=2 -march=i586 -DMODULE -DMODVERSIONS -include /build/tmp/linux-2.4.27/include/linux/modversions.h" MAKING_MODULES=1 modules >make[3]: Entering directory `/build/tmp/loop-AES-v2.1b' >rm -f *.o *.ko *.orig *.rej *.mod.c patched-loop.[ch] test-file[1234] >rm -f -r test-dir1 tmp-d-kbuild >rm -f patched-loop.[ch] >cp loop.c-2.4.patched patched-loop.c >gcc -D__KERNEL__ -I/build/tmp/linux-2.4.27/include -Wall -Wstrict-prototypes -Wno-trigraphs -O2 -fno-strict-aliasing -fno-common -fomit-frame-pointer -pipe -mpreferred-stack-boundary=2 -march=i586 -DMODULE -DMODVERSIONS -include /build/tmp/linux-2.4.27/include/linux/modversions.h -nostdinc -iwithprefix include -DPENTIUM_ASM -DKBUILD_BASENAME=patched_loop -DKBUILD_MODNAME=loop -DEXPORT_SYMTAB -c patched-loop.c -o patched-loop.o >gcc -D__KERNEL__ -I/build/tmp/linux-2.4.27/include -Wall -Wstrict-prototypes -Wno-trigraphs -O2 -fno-strict-aliasing -fno-common -fomit-frame-pointer -pipe -mpreferred-stack-boundary=2 -march=i586 -DMODULE -DMODVERSIONS -include /build/tmp/linux-2.4.27/include/linux/modversions.h -nostdinc -iwithprefix include -DPENTIUM_ASM -DKBUILD_BASENAME=glue -DKBUILD_MODNAME=loop -c glue.c -o glue.o >gcc -D__ASSEMBLY__ -D__KERNEL__ -I/build/tmp/linux-2.4.27/include -c aes-i586.S -o aes-i586.o >gcc -D__ASSEMBLY__ -D__KERNEL__ -I/build/tmp/linux-2.4.27/include -c md5-i586.S -o md5-i586.o >ld -m elf_i386 -r patched-loop.o glue.o aes-i586.o md5-i586.o -o loop.o >mkdir -p /build/tmp/loop-AES-v2.1b/lib/modules/2.4.27-grsec/block >cp -p loop.o /build/tmp/loop-AES-v2.1b/lib/modules/2.4.27-grsec/block >rm -f /build/tmp/loop-AES-v2.1b/lib/modules/2.4.27-grsec/kernel/drivers/block/loop.{,k}o >/sbin/depmod -a -b /build/tmp/loop-AES-v2.1b -F /build/tmp/linux-2.4.27/System.map 2.4.27-grsec >depmod: ELF file /build/tmp/loop-AES-v2.1b/lib/modules/2.4.27-grsec/block/loop.o not for this architecture >make[3]: *** [modules] Error 1 >make[3]: Leaving directory `/build/tmp/loop-AES-v2.1b' >make[2]: *** [_mod_/build/tmp/loop-AES-v2.1b] Error 2 >make[2]: Leaving directory `/build/tmp/linux-2.4.27' >make[1]: *** [all] Error 2 >make[1]: Leaving directory `/build/tmp/loop-AES-v2.1b' > > -- Regards Heiko Zuerker http://www.devil-linux.org |
|
From: Frank P. <pi...@we...> - 2004-09-08 16:49:09
|
Hello, I tried to compile 1.2 CVS from 7th of September on my dual Opteron system. The compilation stops in loop-AES. executing loop-AES with option build (in /build/tmp/loop-AES-v2.1b) ERROR /build/scripts/loop-AES build failed check log file /build/tmp/LOGS/build/loop-AES for details make: *** [build] Error 1 interesting message inside "loop.o not for this architecture", the whole log file is attached. Note I was able to compile a 1.0 long time ago and also a 1.2b1 on this machine. Additionally I had a problem in documentation: http://www.devil-linux.org/documentation/1.2.x/ch03s02.html There is stated "make build install prepare iso dist" But 'make build' fails, after I used m'make prepare' at first, it works. Regards Frank |
|
From: SourceForge.net <no...@so...> - 2004-09-08 15:42:37
|
Bugs item #1023956, was opened at 2004-09-07 15:18 Message generated for change (Settings changed) made by smiley73 You can respond by visiting: https://sourceforge.net/tracker/?func=detail&atid=410643&aid=1023956&group_id=34096 Category: Base System Group: v1.3 >Status: Closed >Resolution: Fixed Priority: 5 Submitted By: Heiko Zuerker (smiley73) >Assigned to: Heiko Zuerker (smiley73) Summary: cyrus-imapd doesn't compile in 1.3 Initial Comment: must either be the new gcc 3.4.1 or the glibc with nptl search for patches..... ---------------------------------------------------------------------- You can respond by visiting: https://sourceforge.net/tracker/?func=detail&atid=410643&aid=1023956&group_id=34096 |