Robin Cook - 2006-02-03

Logged In: YES
user_id=5208

Sorry this was with the cvs checkout.

The below is the 0.10.0 error though the might be the same.

g++ -DHAVE_CONFIG_H -I. -I. -I../.. -I../../src
-march=athlon-mp -mmmx -mfpmath=sse -msse -m3dnow -pipe
-DPIC -fPIC -O3 -MT coremorphanimation.lo -MD -MP -MF
.deps/coremorphanimation.Tpo -c coremorphanimation.cpp
-fPIC -DPIC -o .libs/coremorphanimation.o
/bin/sh ../../libtool --tag=CXX --mode=link g++
-march=athlon-mp -mmmx -mfpmath=sse -msse -m3dnow -pipe
-DPIC -fPIC -O3 -z combreloc -s -z combreloc -s -o
libcal3d.la -rpath /usr/lib @all_libraries@ -no-undefined
-version-info 11:0:0 -z combreloc -s animation.lo
animation_action.lo animation_cycle.lo bone.lo
buffersource.lo cal3d_wrapper.lo coreanimation.lo
corebone.lo corekeyframe.lo corematerial.lo coremesh.lo
coremodel.lo coreskeleton.lo coresubmesh.lo
coresubmorphtarget.lo coretrack.lo error.lo global.lo
hardwaremodel.lo loader.lo matrix.lo mesh.lo mixer.lo
model.lo morphtargetmixer.lo physique.lo platform.lo
quaternion.lo renderer.lo saver.lo skeleton.lo
springsystem.lo streamsource.lo submesh.lo vector.lo
tinyxml.lo tinyxmlerror.lo tinyxmlparser.lo tinystr.lo
coremorphanimation.lo
g++ -shared -nostdlib
/usr/lib/gcc/i686-pc-linux-gnu/4.0.2/../../../crti.o
/usr/lib/gcc/i686-pc-linux-gnu/4.0.2/crtbeginS.o
.libs/animation.o
.libs/animation_action.o .libs/animation_cycle.o
.libs/bone.o .libs/buffersource.o .libs/cal3d_wrapper.o
.libs/coreanimation.o .libs/corebone.o .libs/corekeyframe.o
.libs/corematerial.o .libs/coremesh.o .libs/coremodel.o
.libs/coreskeleton.o .libs/coresubmesh.o
.libs/coresubmorphtarget.o .libs/coretrack.o .libs/error.o
.libs/global.o .libs/hardwaremodel.o .libs/loader.o
.libs/matrix.o .libs/mesh.o .libs/mixer.o .libs/model.o
.libs/morphtargetmixer.o .libs/physique.o .libs/platform.o
.libs/quaternion.o .libs/renderer.o .libs/saver.o
.libs/skeleton.o .libs/springsystem.o .libs/streamsource.o
.libs/submesh.o .libs/vector.o .libs/tinyxml.o
.libs/tinyxmlerror.o .libs/tinyxmlparser.o .libs/tinystr.o
.libs/coremorphanimation.o
-L/usr/lib/gcc/i686-pc-linux-gnu/4.0.2
-L/usr/lib/gcc/i686-pc-linux-gnu/4.0.2/../../../../i686-pc-linux-gnu/lib
-L/usr/lib/gcc/i686-pc-linux-gnu/4.0.2/../../..
/usr/lib/libstdc++.so
-L/usr/src/gcc-4.0.2.bld/i686-pc-linux-gnu/libstdc++-v3/src
-L/usr/src/gcc-4.0.2.bld/i686-pc-linux-gnu/libstdc++-v3/src/.libs
-L/usr/src/gcc-4.0.2.bld/gcc -L/usr/i686-pc-linux-gnu/bin
-L/usr/i686-pc-linux-gnu/lib -lm -lc -lgcc_s
/usr/lib/gcc/i686-pc-linux-gnu/4.0.2/crtendS.o
/usr/lib/gcc/i686-pc-linux-gnu/4.0.2/../../../crtn.o
-march=athlon-mp -mmmx -mfpmath=sse -msse -m3dnow
@all_libraries@ -Wl,-soname -Wl,libcal3d.so.11 -o
.libs/libcal3d.so.11.0.0
g++: @all_libraries@: No such file or directory
make[3]: *** [libcal3d.la] Error 1
make[2]: *** [all-recursive] Error 1
make[1]: *** [all-recursive] Error 1
make: *** [all] Error 2
make[3]: Leaving directory `/usr/src/cal3d-0.10.0/src/cal3d'
make[2]: Leaving directory `/usr/src/cal3d-0.10.0/src'
make[1]: Leaving directory `/usr/src/cal3d-0.10.0'