Menu ▾ ▴

#16 Compile error 3.0.17 / 3.2.1 with same error

open
nobody
None
5
2012-01-17
2012-01-17
Anonymous
No

I tried to compile a vanilla kernel with 3.0.17 and 3.2.1. Both failed with:

===========================
CC fs/aufs/module.o
In file included from fs/aufs/aufs.h:45,
from fs/aufs/module.c:25:
fs/aufs/file.h: In function ‘au_vm_prfile_set’:
fs/aufs/file.h:289: error: ‘struct vm_area_struct’ has no member named ‘vm_prfile’
make[2]: *** [fs/aufs/module.o] Error 1
make[1]: *** [fs/aufs] Error 2
make: *** [fs] Error 2
==============

patching was OK.

Discussion


Log in to post a comment.