#518 stockplots.cc:57: error: 'max_element' is not a member of 's

open
nobody
None
5
2009-08-13
2009-08-13
Anonymous
No

stockplots.cc:57: error: 'max_element' is not a member of 'std'
stockplots.cc: In member function 'virtual void libachart::obv_plot::setup(quoteset&, libachart::chart&)':
stockplots.cc:86: error: 'max_element' is not a member of 'std'
make[1]: *** [stockplots.lo] Error 1
make[1]: *** Waiting for unfinished jobs....
chart.cc: In member function 'void libachart::chart::set_number_of_plots(long unsigned int, long unsigned int)':
chart.cc:350: error: 'memset' was not declared in this scope
make[1]: *** [chart.lo] Error 1
In file included from stockchart.cc:24:
../libaqe/quote.h:32: warning: declaration 'enum historic_quote_source::historic_quote_period' does not declare anything
mv -f .deps/stockchart.Tpo .deps/stockchart.Plo
make[1]: Leaving directory `/home/kc/ast-0.3.0_pre1/src/libachart'
make: *** [all-recursive] Error 1

Discussion


Log in to post a comment.