Menu ▾ ▴

#32 Fails to build with `make: *** [6502/6502.mk:41: 6502/mpt.obx] Error 1`.

3.0.0_BETA
closed-fixed
ftbs (1)
5
2023-05-07
2023-05-06
Drei Eck
No

I download the latest code from git at git.code.sf.net/p/asap/code.

Build fails for me.

I have xasm and mads installed. When I then run make in the directory that contains asap.c, it first prints warnings 6502/mpt.asx (10) WARNING: Comment starts with a comma. Unintended whitespace? and then fails with make: *** [6502/6502.mk:41: 6502/mpt.obx] Error 1.

Full output of make:

6502/cmc.obx
6502/cm3.obx
6502/cmr.obx
6502/cms.obx
6502/dlt.obx
6502/mpt.obx
addr   equ $ec ,$ed
6502/mpt.asx (10) WARNING: Comment starts with a comma. Unintended whitespace?
word   equ $ee ,$ef
6502/mpt.asx (11) WARNING: Comment starts with a comma. Unintended whitespace?
audzer equ $f0 ,$f1 ,$f2 ,$f3
6502/mpt.asx (12) WARNING: Comment starts with a comma. Unintended whitespace?
licslp equ $f4 ,$f5 ,$f6 ,$f7
6502/mpt.asx (13) WARNING: Comment starts with a comma. Unintended whitespace?
adrs1  equ $fa ,$fb
6502/mpt.asx (16) WARNING: Comment starts with a comma. Unintended whitespace?
adrs2  equ $fc ,$fd
6502/mpt.asx (17) WARNING: Comment starts with a comma. Unintended whitespace?
adrsmp equ $fe ,$ff
6502/mpt.asx (18) WARNING: Comment starts with a comma. Unintended whitespace?
make: *** [6502/6502.mk:41: 6502/mpt.obx] Error 1
make: *** Deleting file '6502/mpt.obx'

The file 6502/6502.mk has at line 41 $(XASM) -l.

Version information:

  • git describe --tags: ASAP_5_3_0-11-g8299c87
  • xasm --version | head -n1: xasm 3.2.1
  • mads --version | head -n1: mads 2.1.0
  • gcc --version | head -n1: gcc (GCC) 13.1.1 20230429

On Artix GNU/ Linux (rolling release).

Regards!

Discussion

  • Piotr Fusik

    Piotr Fusik - 2023-05-07
    • status: open --> closed-fixed
     
  • Piotr Fusik

    Piotr Fusik - 2023-05-07

    Thanks for reporting it! You are using xasm from its master branch and its last commit broke ASAP. I've just reverted it.

     

Log in to post a comment.