I just tried to compile app_conference with Asterisk 1.6. It will not compile.
Contact: preston at 2gac d0t net
Error from Make:
cc -pipe -Wall -Wmissing-prototypes -Wmissing-declarations -MD -MP -g -fPIC -I../asterisk-1.6.0-beta2/include -D_REENTRANT -D_GNU_SOURCE -DREVISION=\"exported\" -DCRYPTO -Ilibspeex -DSILDET=2 -c -o conference.o conference.c
In file included from ../asterisk-1.6.0-beta2/include/asterisk/utils.h:26,
from app_conference.h:47,
from conference.h:38,
from conference.c:32:
../asterisk-1.6.0-beta2/include/asterisk/network.h:88: error: expected ‘=’, ‘,’, ‘;’, ‘asm’ or ‘__attribute__’ before ‘int’
In file included from app_conference.h:47,
from conference.h:38,
from conference.c:32:
../asterisk-1.6.0-beta2/include/asterisk/utils.h:265: error: expected ‘=’, ‘,’, ‘;’, ‘asm’ or ‘__attribute__’ before ‘void’
../asterisk-1.6.0-beta2/include/asterisk/utils.h:278: error: expected ‘=’, ‘,’, ‘;’, ‘asm’ or ‘__attribute__’ before ‘void’
../asterisk-1.6.0-beta2/include/asterisk/utils.h:291: error: expected ‘=’, ‘,’, ‘;’, ‘asm’ or ‘__attribute__’ before ‘void’
../asterisk-1.6.0-beta2/include/asterisk/utils.h:304: error: expected ‘=’, ‘,’, ‘;’, ‘asm’ or ‘__attribute__’ before ‘void’
../asterisk-1.6.0-beta2/include/asterisk/utils.h:416: error: expected ‘=’, ‘,’, ‘;’, ‘asm’ or ‘__attribute__’ before ‘_ast_malloc’
../asterisk-1.6.0-beta2/include/asterisk/utils.h:416: error: expected ‘=’, ‘,’, ‘;’, ‘asm’ or ‘__attribute__’ before ‘_ast_malloc’
../asterisk-1.6.0-beta2/include/asterisk/utils.h:439: error: expected ‘=’, ‘,’, ‘;’, ‘asm’ or ‘__attribute__’ before ‘_ast_calloc’
../asterisk-1.6.0-beta2/include/asterisk/utils.h:439: error: expected ‘=’, ‘,’, ‘;’, ‘asm’ or ‘__attribute__’ before ‘_ast_calloc’
../asterisk-1.6.0-beta2/include/asterisk/utils.h:475: error: expected ‘=’, ‘,’, ‘;’, ‘asm’ or ‘__attribute__’ before ‘_ast_realloc’
../asterisk-1.6.0-beta2/include/asterisk/utils.h:475: error: expected ‘=’, ‘,’, ‘;’, ‘asm’ or ‘__attribute__’ before ‘_ast_realloc’
../asterisk-1.6.0-beta2/include/asterisk/utils.h:502: error: expected ‘=’, ‘,’, ‘;’, ‘asm’ or ‘__attribute__’ before ‘_ast_strdup’
../asterisk-1.6.0-beta2/include/asterisk/utils.h:502: error: expected ‘=’, ‘,’, ‘;’, ‘asm’ or ‘__attribute__’ before ‘_ast_strdup’
../asterisk-1.6.0-beta2/include/asterisk/utils.h:531: error: expected ‘=’, ‘,’, ‘;’, ‘asm’ or ‘__attribute__’ before ‘_ast_strndup’
../asterisk-1.6.0-beta2/include/asterisk/utils.h:531: error: expected ‘=’, ‘,’, ‘;’, ‘asm’ or ‘__attribute__’ before ‘_ast_strndup’
../asterisk-1.6.0-beta2/include/asterisk/utils.h: In function ‘_ast_asprintf’:
../asterisk-1.6.0-beta2/include/asterisk/utils.h:556: warning: implicit declaration of function ‘va_start’
../asterisk-1.6.0-beta2/include/asterisk/utils.h:556: warning: implicit declaration of function ‘va_end’
In file included from ../asterisk-1.6.0-beta2/include/asterisk/strings.h:28,
from ../asterisk-1.6.0-beta2/include/asterisk/utils.h:655,
from app_conference.h:47,
from conference.h:38,
from conference.c:32:
../asterisk-1.6.0-beta2/include/asterisk/threadstorage.h: In function ‘ast_threadstorage_get’:
../asterisk-1.6.0-beta2/include/asterisk/threadstorage.h:168: warning: implicit declaration of function ‘_ast_calloc’
../asterisk-1.6.0-beta2/include/asterisk/threadstorage.h:168: warning: assignment makes pointer from integer without a cast
In file included from ../asterisk-1.6.0-beta2/include/asterisk/utils.h:655,
from app_conference.h:47,
from conference.h:38,
from conference.c:32:
../asterisk-1.6.0-beta2/include/asterisk/strings.h: At top level:
../asterisk-1.6.0-beta2/include/asterisk/strings.h:32: error: expected ‘=’, ‘,’, ‘;’, ‘asm’ or ‘__attribute__’ before ‘int’
../asterisk-1.6.0-beta2/include/asterisk/strings.h:349: error: expected ‘=’, ‘,’, ‘;’, ‘asm’ or ‘__attribute__’ before ‘ast_str_create’
../asterisk-1.6.0-beta2/include/asterisk/strings.h:349: error: expected ‘=’, ‘,’, ‘;’, ‘asm’ or ‘__attribute__’ before ‘ast_str_create’
../asterisk-1.6.0-beta2/include/asterisk/strings.h: In function ‘ast_str_make_space’:
../asterisk-1.6.0-beta2/include/asterisk/strings.h:397: warning: implicit declaration of function ‘_ast_realloc’
../asterisk-1.6.0-beta2/include/asterisk/strings.h: At top level:
../asterisk-1.6.0-beta2/include/asterisk/strings.h:681: error: expected ‘=’, ‘,’, ‘;’, ‘asm’ or ‘__attribute__’ before ‘int’
In file included from app_conference.h:48,
from conference.h:38,
from conference.c:32:
../asterisk-1.6.0-beta2/include/asterisk/pbx.h:79: warning: ‘struct ast_channel’ declared inside parameter list
../asterisk-1.6.0-beta2/include/asterisk/pbx.h:79: warning: its scope is only this definition or declaration, which is probably not what you want
../asterisk-1.6.0-beta2/include/asterisk/pbx.h:80: warning: ‘struct ast_channel’ declared inside parameter list
../asterisk-1.6.0-beta2/include/asterisk/pbx.h:87: warning: ‘struct ast_channel’ declared inside parameter list
../asterisk-1.6.0-beta2/include/asterisk/pbx.h:167: warning: ‘struct ast_channel’ declared inside parameter list
../asterisk-1.6.0-beta2/include/asterisk/pbx.h:254: warning: ‘struct ast_channel’ declared inside parameter list
../asterisk-1.6.0-beta2/include/asterisk/pbx.h:269: warning: ‘struct ast_channel’ declared inside parameter list
../asterisk-1.6.0-beta2/include/asterisk/pbx.h:311: warning: ‘struct ast_channel’ declared inside parameter list
../asterisk-1.6.0-beta2/include/asterisk/pbx.h:367: warning: ‘struct ast_channel’ declared inside parameter list
../asterisk-1.6.0-beta2/include/asterisk/pbx.h:382: warning: ‘struct ast_channel’ declared inside parameter list
../asterisk-1.6.0-beta2/include/asterisk/pbx.h:397: warning: ‘struct ast_channel’ declared inside parameter list
../asterisk-1.6.0-beta2/include/asterisk/pbx.h:407: warning: ‘struct ast_channel’ declared inside parameter list
../asterisk-1.6.0-beta2/include/asterisk/pbx.h:423: warning: ‘struct ast_channel’ declared inside parameter list
../asterisk-1.6.0-beta2/include/asterisk/pbx.h:440: warning: ‘struct ast_channel’ declared inside parameter list
../asterisk-1.6.0-beta2/include/asterisk/pbx.h:488: warning: ‘struct ast_channel’ declared inside parameter list
../asterisk-1.6.0-beta2/include/asterisk/pbx.h:737: warning: ‘struct ast_channel’ declared inside parameter list
../asterisk-1.6.0-beta2/include/asterisk/pbx.h:743: warning: ‘struct ast_channel’ declared inside parameter list
../asterisk-1.6.0-beta2/include/asterisk/pbx.h:743: warning: ‘struct ast_variable’ declared inside parameter list
../asterisk-1.6.0-beta2/include/asterisk/pbx.h:747: warning: ‘struct ast_channel’ declared inside parameter list
../asterisk-1.6.0-beta2/include/asterisk/pbx.h:747: warning: ‘struct ast_variable’ declared inside parameter list
../asterisk-1.6.0-beta2/include/asterisk/pbx.h:805: warning: ‘struct ast_channel’ declared inside parameter list
../asterisk-1.6.0-beta2/include/asterisk/pbx.h:810: warning: ‘struct ast_channel’ declared inside parameter list
../asterisk-1.6.0-beta2/include/asterisk/pbx.h:815: warning: ‘struct ast_channel’ declared inside parameter list
../asterisk-1.6.0-beta2/include/asterisk/pbx.h:820: warning: ‘struct ast_channel’ declared inside parameter list
../asterisk-1.6.0-beta2/include/asterisk/pbx.h:825: warning: ‘struct ast_channel’ declared inside parameter list
../asterisk-1.6.0-beta2/include/asterisk/pbx.h:831: warning: ‘struct ast_channel’ declared inside parameter list
../asterisk-1.6.0-beta2/include/asterisk/pbx.h:833: warning: ‘struct ast_channel’ declared inside parameter list
../asterisk-1.6.0-beta2/include/asterisk/pbx.h:835: warning: ‘struct ast_channel’ declared inside parameter list
../asterisk-1.6.0-beta2/include/asterisk/pbx.h:853: warning: ‘struct ast_channel’ declared inside parameter list
../asterisk-1.6.0-beta2/include/asterisk/pbx.h:862: warning: ‘struct ast_channel’ declared inside parameter list
../asterisk-1.6.0-beta2/include/asterisk/pbx.h:867: warning: ‘struct ast_channel’ declared inside parameter list
../asterisk-1.6.0-beta2/include/asterisk/pbx.h:872: warning: ‘struct ast_channel’ declared inside parameter list
../asterisk-1.6.0-beta2/include/asterisk/pbx.h:913: warning: ‘struct ast_channel’ declared inside parameter list
../asterisk-1.6.0-beta2/include/asterisk/pbx.h:926: warning: ‘struct ast_channel’ declared inside parameter list
../asterisk-1.6.0-beta2/include/asterisk/pbx.h:970: warning: ‘struct ast_channel’ declared inside parameter list
In file included from app_conference.h:49,
from conference.h:38,
from conference.c:32:
../asterisk-1.6.0-beta2/include/asterisk/module.h:227: warning: ‘struct ast_channel’ declared inside parameter list
../asterisk-1.6.0-beta2/include/asterisk/module.h:401: warning: ‘struct ast_channel’ declared inside parameter list
In file included from app_conference.h:56,
from conference.h:38,
from conference.c:32:
../asterisk-1.6.0-beta2/include/asterisk/channel.h:1225: warning: no previous prototype for ‘ast_cause2str’
../asterisk-1.6.0-beta2/include/asterisk/channel.h: In function ‘ast_cause2str’:
../asterisk-1.6.0-beta2/include/asterisk/channel.h:1225: error: expected declaration specifiers before ‘attribute_pure’
../asterisk-1.6.0-beta2/include/asterisk/channel.h:1232: error: expected ‘=’, ‘,’, ‘;’, ‘asm’ or ‘__attribute__’ before ‘attribute_pure’
../asterisk-1.6.0-beta2/include/asterisk/channel.h:1249: error: expected ‘=’, ‘,’, ‘;’, ‘asm’ or ‘__attribute__’ before ‘attribute_const’
../asterisk-1.6.0-beta2/include/asterisk/channel.h:1412: warning: empty declaration
../asterisk-1.6.0-beta2/include/asterisk/channel.h:1458: error: expected ‘=’, ‘,’, ‘;’, ‘asm’ or ‘__attribute__’ before ‘{’ token
../asterisk-1.6.0-beta2/include/asterisk/channel.h:1466: error: expected ‘=’, ‘,’, ‘;’, ‘asm’ or ‘__attribute__’ before ‘{’ token
../asterisk-1.6.0-beta2/include/asterisk/channel.h:1507: error: expected ‘=’, ‘,’, ‘;’, ‘asm’ or ‘__attribute__’ before ‘{’ token
../asterisk-1.6.0-beta2/include/asterisk/channel.h:1576: warning: empty declaration
In file included from /usr/include/fcntl.h:33,
from ../asterisk-1.6.0-beta2/include/asterisk/file.h:29,
from app_conference.h:57,
from conference.h:38,
from conference.c:32:
/usr/include/bits/fcntl.h:187: error: storage class specified for parameter ‘readahead’
In file included from /usr/include/fcntl.h:37,
from ../asterisk-1.6.0-beta2/include/asterisk/file.h:29,
from app_conference.h:57,
from conference.h:38,
from conference.c:32:
/usr/include/sys/stat.h:217: error: storage class specified for parameter ‘stat’
/usr/include/sys/stat.h:219: error: storage class specified for parameter ‘fstat’
/usr/include/sys/stat.h:227: error: storage class specified for parameter ‘stat64’
/usr/include/sys/stat.h:228: error: storage class specified for parameter ‘fstat64’
/usr/include/sys/stat.h:242: error: storage class specified for parameter ‘lstat’
/usr/include/sys/stat.h:250: error: storage class specified for parameter ‘lstat64’
/usr/include/sys/stat.h:257: error: storage class specified for parameter ‘chmod’
/usr/include/sys/stat.h:264: error: storage class specified for parameter ‘lchmod’
/usr/include/sys/stat.h:269: error: storage class specified for parameter ‘fchmod’
/usr/include/sys/stat.h:275: error: storage class specified for parameter ‘umask’
/usr/include/sys/stat.h:280: error: storage class specified for parameter ‘getumask’
/usr/include/sys/stat.h:285: error: storage class specified for parameter ‘mkdir’
/usr/include/sys/stat.h:292: error: storage class specified for parameter ‘mknod’
/usr/include/sys/stat.h:298: error: storage class specified for parameter ‘mkfifo’
/usr/include/sys/stat.h:334: error: storage class specified for parameter ‘__fxstat’
/usr/include/sys/stat.h:337: error: storage class specified for parameter ‘__xstat’
/usr/include/sys/stat.h:340: error: storage class specified for parameter ‘__lxstat’
/usr/include/sys/stat.h:351: error: storage class specified for parameter ‘__fxstat64’
/usr/include/sys/stat.h:353: error: storage class specified for parameter ‘__xstat64’
/usr/include/sys/stat.h:355: error: storage class specified for parameter ‘__lxstat64’
/usr/include/sys/stat.h:358: error: storage class specified for parameter ‘__xmknod’
/usr/include/sys/stat.h:365: error: expected ‘=’, ‘,’, ‘;’, ‘asm’ or ‘__attribute__’ before ‘{’ token
/usr/include/sys/stat.h:372: error: expected ‘=’, ‘,’, ‘;’, ‘asm’ or ‘__attribute__’ before ‘{’ token
/usr/include/sys/stat.h:379: error: expected ‘=’, ‘,’, ‘;’, ‘asm’ or ‘__attribute__’ before ‘{’ token
/usr/include/sys/stat.h:386: error: expected ‘=’, ‘,’, ‘;’, ‘asm’ or ‘__attribute__’ before ‘{’ token
In file included from ../asterisk-1.6.0-beta2/include/asterisk/file.h:29,
from app_conference.h:57,
from conference.h:38,
from conference.c:32:
/usr/include/fcntl.h:63: error: storage class specified for parameter ‘fcntl’
/usr/include/fcntl.h:76: error: storage class specified for parameter ‘open’
/usr/include/fcntl.h:82: error: storage class specified for parameter ‘open64’
/usr/include/fcntl.h:94: error: storage class specified for parameter ‘creat’
/usr/include/fcntl.h:101: error: storage class specified for parameter ‘creat64’
/usr/include/fcntl.h:141: error: storage class specified for parameter ‘posix_fadvise’
/usr/include/fcntl.h:150: error: storage class specified for parameter ‘posix_fadvise64’
/usr/include/fcntl.h:162: error: storage class specified for parameter ‘posix_fallocate’
/usr/include/fcntl.h:170: error: storage class specified for parameter ‘posix_fallocate64’
In file included from ../asterisk-1.6.0-beta2/include/asterisk/file.h:33,
from app_conference.h:57,
from conference.h:38,
from conference.c:32:
/usr/include/sys/mman.h:62: error: storage class specified for parameter ‘mmap’
/usr/include/sys/mman.h:72: error: storage class specified for parameter ‘mmap64’
/usr/include/sys/mman.h:77: error: storage class specified for parameter ‘munmap’
/usr/include/sys/mman.h:82: error: storage class specified for parameter ‘mprotect’
/usr/include/sys/mman.h:90: error: storage class specified for parameter ‘msync’
/usr/include/sys/mman.h:95: error: storage class specified for parameter ‘madvise’
/usr/include/sys/mman.h:99: error: storage class specified for parameter ‘posix_madvise’
/usr/include/sys/mman.h:104: error: storage class specified for parameter ‘mlock’
/usr/include/sys/mman.h:107: error: storage class specified for parameter ‘munlock’
/usr/include/sys/mman.h:112: error: storage class specified for parameter ‘mlockall’
/usr/include/sys/mman.h:116: error: storage class specified for parameter ‘munlockall’
/usr/include/sys/mman.h:123: error: storage class specified for parameter ‘mremap’
/usr/include/sys/mman.h:131: error: storage class specified for parameter ‘mincore’
/usr/include/sys/mman.h:136: error: storage class specified for parameter ‘remap_file_pages’
/usr/include/sys/mman.h:141: error: storage class specified for parameter ‘shm_open’
/usr/include/sys/mman.h:144: error: storage class specified for parameter ‘shm_unlink’
In file included from app_conference.h:57,
from conference.h:38,
from conference.c:32:
../asterisk-1.6.0-beta2/include/asterisk/file.h:40: warning: empty declaration
../asterisk-1.6.0-beta2/include/asterisk/file.h:41: warning: empty declaration
In file included from app_conference.h:59,
from conference.h:38,
from conference.c:32:
../asterisk-1.6.0-beta2/include/asterisk/cli.h:131: warning: empty declaration
../asterisk-1.6.0-beta2/include/asterisk/cli.h:142: warning: empty declaration
../asterisk-1.6.0-beta2/include/asterisk/cli.h:144: warning: empty declaration
../asterisk-1.6.0-beta2/include/asterisk/cli.h:145: error: storage class specified for parameter ‘cli_fn’
../asterisk-1.6.0-beta2/include/asterisk/cli.h:170: error: expected specifier-qualifier-list before ‘cli_fn’
../asterisk-1.6.0-beta2/include/asterisk/cli.h:174: warning: empty declaration
In file included from app_conference.h:63,
from conference.h:38,
from conference.c:32:
libspeex/speex_preprocess.h:39: warning: empty declaration
libspeex/speex_preprocess.h:99: error: storage class specified for parameter ‘SpeexPreprocessState’
libspeex/speex_preprocess.h:102: error: expected declaration specifiers before ‘SpeexPreprocessState’
libspeex/speex_preprocess.h:105: error: expected ‘)’ before ‘*’ token
libspeex/speex_preprocess.h:108: error: expected ‘)’ before ‘*’ token
libspeex/speex_preprocess.h:111: error: expected ‘)’ before ‘*’ token
libspeex/speex_preprocess.h:114: error: expected ‘)’ before ‘*’ token
In file included from conference.h:38,
from conference.c:32:
app_conference.h:215: warning: empty declaration
In file included from common.h:37,
from conference.h:39,
from conference.c:32:
conf_frame.h:70: error: storage class specified for parameter ‘conf_frame’
In file included from common.h:42,
from conference.h:39,
from conference.c:32:
frame.h:46: error: expected declaration specifiers before ‘conf_frame’
frame.h:48: error: expected declaration specifiers before ‘conf_frame’
frame.h:49: error: expected declaration specifiers before ‘conf_frame’
frame.h:52: error: expected declaration specifiers before ‘conf_frame’
frame.h:53: error: expected declaration specifiers before ‘conf_frame’
frame.h:54: error: expected declaration specifiers before ‘conf_frame’
frame.h:69: error: expected declaration specifiers before ‘conf_frame’
frame.h:73: error: expected ‘)’ before ‘*’ token
In file included from conference.c:32:
conference.h:66: error: storage class specified for parameter ‘ast_conference_stats’
conference.h:107: error: expected specifier-qualifier-list before ‘ast_conference_stats’
conference.h:114: warning: empty declaration
In file included from conference.h:117,
from conference.c:32:
member.h:51: warning: empty declaration
member.h:105: error: expected specifier-qualifier-list before ‘conf_frame’
member.h:243: warning: empty declaration
member.h:249: warning: empty declaration
member.h:266: error: expected declaration specifiers before ‘conf_frame’
member.h:267: error: expected declaration specifiers before ‘conf_frame’
member.h:268: error: expected declaration specifiers before ‘conf_frame’
member.h:273: error: expected declaration specifiers before ‘conf_frame’
member.h:276: error: expected declaration specifiers before ‘conf_frame’
member.h:279: error: expected declaration specifiers before ‘conf_frame’
member.h:280: error: expected declaration specifiers before ‘conf_frame’
member.h:302: warning: empty declaration
member.h:304: error: storage class specified for parameter ‘ast_packer_new’
member.h:305: error: storage class specified for parameter ‘ast_packer_set_flags’
member.h:306: error: storage class specified for parameter ‘ast_packer_get_flags’
member.h:307: error: storage class specified for parameter ‘ast_packer_free’
member.h:308: error: storage class specified for parameter ‘ast_packer_reset’
member.h:309: error: storage class specified for parameter ‘ast_packer_feed’
member.h:310: error: storage class specified for parameter ‘ast_packer_read’
In file included from conference.c:32:
conference.h:135: error: expected declaration specifiers or ‘...’ before ‘conf_frame’
conference.h:136: error: expected declaration specifiers or ‘...’ before ‘conf_frame’
conference.h:166: error: expected ‘)’ before ‘*’ token
conference.h:167: error: expected ‘)’ before ‘*’ token
conference.c:40: error: parameter ‘conflist’ is initialized
conference.c:44: error: storage class specified for parameter ‘conflist_lock’
conference.c:44: error: parameter ‘conflist_lock’ is initialized
conference.c:46: error: storage class specified for parameter ‘conference_count’
conference.c:46: error: parameter ‘conference_count’ is initialized
conference.c:54: error: expected ‘=’, ‘,’, ‘;’, ‘asm’ or ‘__attribute__’ before ‘{’ token
conference.c:447: error: expected ‘=’, ‘,’, ‘;’, ‘asm’ or ‘__attribute__’ before ‘{’ token
conference.c:452: error: expected ‘=’, ‘,’, ‘;’, ‘asm’ or ‘__attribute__’ before ‘{’ token
conference.c:503: error: expected ‘=’, ‘,’, ‘;’, ‘asm’ or ‘__attribute__’ before ‘{’ token
conference.c:531: error: expected ‘=’, ‘,’, ‘;’, ‘asm’ or ‘__attribute__’ before ‘{’ token
conference.c:636: error: expected ‘=’, ‘,’, ‘;’, ‘asm’ or ‘__attribute__’ before ‘{’ token
conference.c:713: error: expected ‘=’, ‘,’, ‘;’, ‘asm’ or ‘__attribute__’ before ‘{’ token
conference.c:737: error: expected ‘=’, ‘,’, ‘;’, ‘asm’ or ‘__attribute__’ before ‘{’ token
conference.c:792: error: expected ‘=’, ‘,’, ‘;’, ‘asm’ or ‘__attribute__’ before ‘{’ token
conference.c:868: error: expected ‘=’, ‘,’, ‘;’, ‘asm’ or ‘__attribute__’ before ‘{’ token
conference.c:1032: error: expected ‘=’, ‘,’, ‘;’, ‘asm’ or ‘__attribute__’ before ‘{’ token
conference.c:1063: error: expected ‘=’, ‘,’, ‘;’, ‘asm’ or ‘__attribute__’ before ‘{’ token
conference.c:1106: error: expected ‘=’, ‘,’, ‘;’, ‘asm’ or ‘__attribute__’ before ‘{’ token
conference.c:1111: error: expected ‘=’, ‘,’, ‘;’, ‘asm’ or ‘__attribute__’ before ‘{’ token
conference.c:1140: error: expected ‘=’, ‘,’, ‘;’, ‘asm’ or ‘__attribute__’ before ‘{’ token
conference.c:1221: error: expected ‘=’, ‘,’, ‘;’, ‘asm’ or ‘__attribute__’ before ‘{’ token
conference.c:1293: error: expected ‘=’, ‘,’, ‘;’, ‘asm’ or ‘__attribute__’ before ‘{’ token
conference.c:1344: error: expected ‘=’, ‘,’, ‘;’, ‘asm’ or ‘__attribute__’ before ‘{’ token
conference.c:1398: error: expected ‘=’, ‘,’, ‘;’, ‘asm’ or ‘__attribute__’ before ‘{’ token
conference.c:1440: error: expected ‘=’, ‘,’, ‘;’, ‘asm’ or ‘__attribute__’ before ‘{’ token
conference.c:1489: error: expected ‘=’, ‘,’, ‘;’, ‘asm’ or ‘__attribute__’ before ‘{’ token
conference.c:1538: error: expected ‘=’, ‘,’, ‘;’, ‘asm’ or ‘__attribute__’ before ‘{’ token
conference.c:1587: error: expected ‘=’, ‘,’, ‘;’, ‘asm’ or ‘__attribute__’ before ‘{’ token
conference.c:1636: error: expected ‘=’, ‘,’, ‘;’, ‘asm’ or ‘__attribute__’ before ‘{’ token
conference.c:1689: error: expected ‘=’, ‘,’, ‘;’, ‘asm’ or ‘__attribute__’ before ‘{’ token
conference.c:1757: error: expected ‘)’ before ‘*’ token
conference.c:1794: error: expected ‘)’ before ‘*’ token
conference.c:1831: error: expected ‘=’, ‘,’, ‘;’, ‘asm’ or ‘__attribute__’ before ‘{’ token
conference.c:1875: error: expected ‘=’, ‘,’, ‘;’, ‘asm’ or ‘__attribute__’ before ‘{’ token
conference.c:1991: error: expected ‘=’, ‘,’, ‘;’, ‘asm’ or ‘__attribute__’ before ‘{’ token
conference.c:2038: error: expected ‘=’, ‘,’, ‘;’, ‘asm’ or ‘__attribute__’ before ‘{’ token
conference.c:2085: error: expected ‘=’, ‘,’, ‘;’, ‘asm’ or ‘__attribute__’ before ‘{’ token
conference.c:2117: error: expected ‘=’, ‘,’, ‘;’, ‘asm’ or ‘__attribute__’ before ‘{’ token
conference.c:2178: error: expected ‘=’, ‘,’, ‘;’, ‘asm’ or ‘__attribute__’ before ‘{’ token
conference.c:2229: error: expected ‘=’, ‘,’, ‘;’, ‘asm’ or ‘__attribute__’ before ‘{’ token
conference.c:2287: error: expected ‘=’, ‘,’, ‘;’, ‘asm’ or ‘__attribute__’ before ‘{’ token
conference.c:2340: error: expected ‘=’, ‘,’, ‘;’, ‘asm’ or ‘__attribute__’ before ‘{’ token
conference.c:2398: error: expected ‘=’, ‘,’, ‘;’, ‘asm’ or ‘__attribute__’ before ‘{’ token
conference.c:2454: error: expected ‘=’, ‘,’, ‘;’, ‘asm’ or ‘__attribute__’ before ‘{’ token
conference.c:2496: error: expected ‘=’, ‘,’, ‘;’, ‘asm’ or ‘__attribute__’ before ‘{’ token
conference.c:2539: error: expected ‘=’, ‘,’, ‘;’, ‘asm’ or ‘__attribute__’ before ‘{’ token
conference.c:2581: error: expected ‘=’, ‘,’, ‘;’, ‘asm’ or ‘__attribute__’ before ‘{’ token
conference.c:2601: error: expected ‘=’, ‘,’, ‘;’, ‘asm’ or ‘__attribute__’ before ‘{’ token
conference.c:2678: error: expected ‘=’, ‘,’, ‘;’, ‘asm’ or ‘__attribute__’ before ‘{’ token
conference.c:2756: error: expected ‘=’, ‘,’, ‘;’, ‘asm’ or ‘__attribute__’ before ‘{’ token
conference.c:2812: error: expected ‘=’, ‘,’, ‘;’, ‘asm’ or ‘__attribute__’ before ‘{’ token
conference.c:2851: error: expected ‘=’, ‘,’, ‘;’, ‘asm’ or ‘__attribute__’ before ‘{’ token
conference.c:2886: error: old-style parameter declarations in prototyped function definition
conference.c:2886: error: expected ‘{’ at end of input
make: *** [conference.o] Error 1
Logged In: YES
user_id=2079218
Originator: NO
I submitted a patch to the mailing list for this one. Subject line "Another version of the asterisk 1.6 patch".
This patch allows for interoperability between 1.4 and 1.6 versions.
I has not been fully tested against 1.6 but it seemed to work ok for me.