#11 Still trying to compile with OS X 4.11

closed
nobody
5
2011-01-22
2010-08-20
Anonymous
No

Hi,

I tried again to night to get everything to compile. I get the following:

gcc -g -O2 -o xml xml.o xml_edit.o xml_ls.o xml_escape.o xml_pyx.o xml_depyx.o xml_select.o xml_trans.o xml_validate.o xml_format.o xml_elem.o xml_C14N.o trans.o binsert.o stack.o strdup.o /usr/local/lib/libxslt.a /usr/local/lib/libexslt.a -lz -lm -lpthread /usr/local/lib/libxml2.a -lz -lm -lpthread -ldl -L/usr/local/lib
/usr/bin/ld: Undefined symbols:
_libiconv
_libiconv_close
_libiconv_open
collect2: ld returned 1 exit status
make[2]: *** [xml] Error 1
make[1]: *** [all-recursive] Error 1
make: *** [all] Error 2

Please any help?

Thanks,

Russ

Discussion

  • Noam Postavsky
    Noam Postavsky
    2011-01-22

    • status: open --> closed
     
  • Noam Postavsky
    Noam Postavsky
    2011-01-22

    Duplicate of 3049308