#25 wv2 0.4.0 fails to build with gcc 4.4

open
nobody
None
5
2013-08-29
2009-09-21
No

[ 41%] Building CXX object src/CMakeFiles/wv2.dir/ustring.cpp.o
/usr/src/ark/BUILD/wv2-0.4.0/src/ustring.cpp:81:23: error: #elif with no expression
/usr/src/ark/BUILD/wv2-0.4.0/src/ustring.cpp:94:23: error: #elif with no expression
make[2]: *** [src/CMakeFiles/wv2.dir/ustring.cpp.o] Error 1

Discussion

  • Olly Betts
    Olly Betts
    2013-08-29

    This patch was applied in SVN r36 so this ticket can be closed...