xca Icon

User Ratings

★★★★★
★★★★
★★★
★★
47
2
0
1
2
ease 1 of 5 2 of 5 3 of 5 4 of 5 5 of 5 4 / 5
features 1 of 5 2 of 5 3 of 5 4 of 5 5 of 5 4 / 5
design 1 of 5 2 of 5 3 of 5 4 of 5 5 of 5 4 / 5
support 1 of 5 2 of 5 3 of 5 4 of 5 5 of 5 4 / 5
Write a Review

User Reviews

  • puneetbrar
    1 of 5 2 of 5 3 of 5 4 of 5 5 of 5

    Dear All Kindly help getting error in ubuntu 14.04 Unable to execute a freshly compiled application, maybe you have to adjust your LD_LIBRARY_PATH or /etc/ld.so.conf checking for GNU make... make configure: A usable 'make' executable was found in /usr/bin/make checking for linuxdoc... : configure: WARNING: 'linuxdoc' not found, using pre-compiled documentation configure: creating ./config.status config.status: creating Local.mak config.status: creating local.h config.status: local.h is unchanged UIC [ui] ui_About.h LANG [lang] xca_de.qm uic: could not exec '/usr/lib/x86_64-linux-gnu/qt4/bin/uic': No such file or directory make[1]: *** [ui_About.h] Error 1 make[1]: *** Waiting for unfinished jobs.... UIC [ui] ui_CaProperties.h lrelease: could not exec '/usr/lib/x86_64-linux-gnu/qt4/bin/lrelease': No such file or directory make[1]: *** [xca_de.qm] Error 1 make[1]: *** Waiting for unfinished jobs.... LANG [lang] xca_ru.qm DOC [doc] xca.html lrelease: could not exec '/usr/lib/x86_64-linux-gnu/qt4/bin/lrelease': No such file or directory uic: could not exec '/usr/lib/x86_64-linux-gnu/qt4/bin/uic': No such file or directory make[1]: *** [ui_CaProperties.h] Error 1 make[1]: *** [xca_ru.qm] Error 1make: *** [do.ui] Error 2 make: *** Waiting for unfinished jobs.... make: *** [do.lang] Error 2 mkdir -p ui make -C ui -f /home/user1/Desktop/xca-1.1.0/ui/Makefile VPATH=/home/user1/Desktop/xca-1.1.0/ui ui make[1]: Entering directory `/home/user1/Desktop/xca-1.1.0/ui' /usr/bin/uic -o ui_About.h About.ui uic: could not exec '/usr/lib/x86_64-linux-gnu/qt4/bin/uic': No such file or directory make[1]: *** [ui_About.h] Error 1 make[1]: Leaving directory `/home/user1/Desktop/xca-1.1.0/ui' make: *** [do.ui] Error 2

    Posted 02/26/2015