Daniel Drake <dsd@gentoo.org> wrote:
Andrew,

andrew zajac wrote:
> This looks like a ZD1211B. Edit the Makefile (ZD1211REV_B=1) to enable
> support.

I'm interested. Where did you get this device? What is it branded as?

Thanks,
Daniel

I got it at "Bureau en Gros" here in Montreal (staples.ca)  It cost me $29.99 Canadian dollars.  It has no brand on the packaging - "80211B/g Mini Wireless USB Adapter."

On the inside of the packaging, there is a a tech-support phone number (1-800-255-8048) and an email address for stsupport@samtack.com.  This product is not listed on the samtack.com website.

The driver cd ships with windows drivers as well as linux and mac drivers.

ZD1211LnxDrv_2_2_0_0
dated august 19th...

It (the shipped driver) does not compile on Ubuntu breezy or Dapper.



emma@BreezyDown:~/Desktop/ZD1211LnxDrv_2_2_0_0$ make
make both
make[1]: Entering directory `/home/emma/Desktop/ZD1211LnxDrv_2_2_0_0'
make clean
make[2]: Entering directory `/home/emma/Desktop/ZD1211LnxDrv_2_2_0_0'
rm -rf .tmp_versions .*.cmd *.ko *.mod.c *.mod.o *.o src/*.o  src/.*.o.cmd menudbg apdbg
make[2]: Leaving directory `/home/emma/Desktop/ZD1211LnxDrv_2_2_0_0'
make ZD1211REV_B=0
make[2]: Entering directory `/home/emma/Desktop/ZD1211LnxDrv_2_2_0_0'
/lib/modules/2.6.12-10-k7/build
/home/emma/Desktop/ZD1211LnxDrv_2_2_0_0
-I/home/emma/Desktop/ZD1211LnxDrv_2_2_0_0/src/include -fomit-frame-pointer -O2 -Wall -Wstrict-prototypes -pipe -DHOST_IF_USB -DAMAC -DGCCK -DOFDM -DHOSTAPD_SUPPORT -DUSE_EP4_SET_REG -DDOWNLOADFIRMWARE -DfTX_GAIN_OFDM=0 -DfNEW_CODE_MAP=1 -DfWRITE_WORD_REG=1 -DfREAD_MUL_REG=1 -DENHANCE_RX=1 -DZDCONF_MENUDBG -DZDCONF_APDBG -DZD1211
src/zd1205.o src/zdasocsvc.o src/zdauthreq.o src/zdauthrsp.o src/zdmmrx.o src/zdshared.o src/zdhci.o src/zdglobal.o src/zdencrypt.o src/zdpmfilter.o src/zdpsmon.o src/zdsynch.o src/zdbuf.o src/zd1205_proc.o src/zdhw.o src/zddebug.o src/zdtkipseed.o src/zdmic.o src/zddebug2.o src/zdusb.o src/zd1211.o
make -C /lib/modules/2.6.12-10-k7/build SUBDIRS=/home/emma/Desktop/ZD1211LnxDrv_2_2_0_0 modules
make[3]: Entering directory `/usr/src/linux-headers-2.6.12-10-k7'
  CC [M]  /home/emma/Desktop/ZD1211LnxDrv_2_2_0_0/src/zd1205.o
In file included from /home/emma/Desktop/ZD1211LnxDrv_2_2_0_0/src/zd1205.c:42:
/home/emma/Desktop/ZD1211LnxDrv_2_2_0_0/src/zd1205.h:663: warning: `__packed__' attribute ignored
/home/emma/Desktop/ZD1211LnxDrv_2_2_0_0/src/zd1205.c:244: warning: function declaration isn't a prototype
/home/emma/Desktop/ZD1211LnxDrv_2_2_0_0/src/zd1205.c:245: warning: function declaration isn't a prototype
/home/emma/Desktop/ZD1211LnxDrv_2_2_0_0/src/zd1205.c:312: warning: useless keyword or type name in empty declaration
/home/emma/Desktop/ZD1211LnxDrv_2_2_0_0/src/zd1205.c: In function `a_get_cal_int_val':
/home/emma/Desktop/ZD1211LnxDrv_2_2_0_0/src/zd1205.h:1200: sorry, unimplemented: inlining failed in call to 'zd_readl': function body not available
/home/emma/Desktop/ZD1211LnxDrv_2_2_0_0/src/zd1205.c:546: sorry, unimplemented: called from here
/home/emma/Desktop/ZD1211LnxDrv_2_2_0_0/src/zd1205.c: In function `zd1205_house_keeping':
/home/emma/Desktop/ZD1211LnxDrv_2_2_0_0/src/zd1205.c:1441: warning: unused variable `tmpvalue'
/home/emma/Desktop/ZD1211LnxDrv_2_2_0_0/src/zd1205.c: In function `zd1205_config':
/home/emma/Desktop/ZD1211LnxDrv_2_2_0_0/src/zd1205.c:2313: warning: int format, U32 arg (arg 2)
/home/emma/Desktop/ZD1211LnxDrv_2_2_0_0/src/zd1205.c: In function `zd1205_validate_frame':
/home/emma/Desktop/ZD1211LnxDrv_2_2_0_0/src/zd1205.c:2688: warning: unused variable `len1'
/home/emma/Desktop/ZD1211LnxDrv_2_2_0_0/src/zd1205.c: In function `zd1205_close':
/home/emma/Desktop/ZD1211LnxDrv_2_2_0_0/src/zd1205.c:4608: warning: implicit declaration of function `re_initFdescBuf'
/home/emma/Desktop/ZD1211LnxDrv_2_2_0_0/src/zd1205.c: In function `zd1205_xmit_frame':
/home/emma/Desktop/ZD1211LnxDrv_2_2_0_0/src/zd1205.c:4701: warning: suggest parentheses around && within ||
/home/emma/Desktop/ZD1211LnxDrv_2_2_0_0/src/zd1205.c: In function `zd1205_watchdog':
/home/emma/Desktop/ZD1211LnxDrv_2_2_0_0/src/zd1205.c:5334: warning: unused variable `cbTemp'
/home/emma/Desktop/ZD1211LnxDrv_2_2_0_0/src/zd1205.c:5335: warning: unused variable `ssidLenToDump'
/home/emma/Desktop/ZD1211LnxDrv_2_2_0_0/src/zd1205.c: In function `zd1205_ioctl_setiwencode':
/home/emma/Desktop/ZD1211LnxDrv_2_2_0_0/src/zd1205.c:5724: warning: unused variable `bReconnect'
/home/emma/Desktop/ZD1211LnxDrv_2_2_0_0/src/zd1205.c: In function `zd1205wext_siwscan':
/home/emma/Desktop/ZD1211LnxDrv_2_2_0_0/src/zd1205.c:6595: warning: implicit declaration of function `zd_CmdProbeReq'
/home/emma/Desktop/ZD1211LnxDrv_2_2_0_0/src/zd1205.c:6537: warning: unused variable `i'
/home/emma/Desktop/ZD1211LnxDrv_2_2_0_0/src/zd1205.c:6538: warning: unused variable `oldMacMode'
/home/emma/Desktop/ZD1211LnxDrv_2_2_0_0/src/zd1205.c:6539: warning: unused variable `ul_mac_ps_state'
/home/emma/Desktop/ZD1211LnxDrv_2_2_0_0/src/zd1205.c: In function `zd1205_translate_scan':
/home/emma/Desktop/ZD1211LnxDrv_2_2_0_0/src/zd1205.c:6715: warning: unknown conversion type character `,' in format
/home/emma/Desktop/ZD1211LnxDrv_2_2_0_0/src/zd1205.c:6715: warning: spurious trailing `%' in format
/home/emma/Desktop/ZD1211LnxDrv_2_2_0_0/src/zd1205.c: In function `zd1205_list_bss':
/home/emma/Desktop/ZD1211LnxDrv_2_2_0_0/src/zd1205.c:6891: warning: spurious trailing `%' in format
/home/emma/Desktop/ZD1211LnxDrv_2_2_0_0/src/zd1205.c: In function `zd1205_ioctl':
/home/emma/Desktop/ZD1211LnxDrv_2_2_0_0/src/zd1205.c:7163: warning: `verify_area' is deprecated (declared at include/asm/uaccess.h:105)
/home/emma/Desktop/ZD1211LnxDrv_2_2_0_0/src/zd1205.c:7572: warning: ISO C90 forbids mixed declarations and code
/home/emma/Desktop/ZD1211LnxDrv_2_2_0_0/src/zd1205.c:7575: warning: ignoring return value of `copy_from_user', declared with attribute warn_unused_result
/home/emma/Desktop/ZD1211LnxDrv_2_2_0_0/src/zd1205.c:7576: warning: ignoring return value of `copy_to_user', declared with attribute warn_unused_result
/home/emma/Desktop/ZD1211LnxDrv_2_2_0_0/src/zd1205.c: In function `zd1205_load_card_setting':
/home/emma/Desktop/ZD1211LnxDrv_2_2_0_0/src/zd1205.c:7967: warning: suggest parentheses around assignment used as truth value
/home/emma/Desktop/ZD1211LnxDrv_2_2_0_0/src/zd1205.c: In function `zdcb_AssocRequest':
/home/emma/Desktop/ZD1211LnxDrv_2_2_0_0/src/zd1205.c:9153: warning: implicit declaration of function `HashSearch'
/home/emma/Desktop/ZD1211LnxDrv_2_2_0_0/src/zd1205.c:9153: warning: assignment makes pointer from integer without a cast
/home/emma/Desktop/ZD1211LnxDrv_2_2_0_0/src/zd1205.c: In function `zd1205_set_zd_cbs':
/home/emma/Desktop/ZD1211LnxDrv_2_2_0_0/src/zd1205.c:9209: warning: assignment from incompatible pointer type
/home/emma/Desktop/ZD1211LnxDrv_2_2_0_0/src/zd1205.c: In function `CalculateQuality':
/home/emma/Desktop/ZD1211LnxDrv_2_2_0_0/src/zd1205.c:9423: warning: ISO C90 forbids mixed declarations and code
/home/emma/Desktop/ZD1211LnxDrv_2_2_0_0/src/zd1205.c:9425: warning: unused variable `rxOffset'
/home/emma/Desktop/ZD1211LnxDrv_2_2_0_0/src/zd1205.c: At top level:
/home/emma/Desktop/ZD1211LnxDrv_2_2_0_0/src/zd1205.c:89: warning: 'NOVELL' defined but not used
/home/emma/Desktop/ZD1211LnxDrv_2_2_0_0/src/zd1205.c:5707: warning: 'Freq_11A_to_channel' defined but not used
/home/emma/Desktop/ZD1211LnxDrv_2_2_0_0/src/zd1205.c:6445: warning: 'zd1205wext_giwtxpow' defined but not used
/home/emma/Desktop/ZD1211LnxDrv_2_2_0_0/src/zd1205.c:6453: warning: 'zd1205wext_siwtxpow' defined but not used
make[4]: *** [/home/emma/Desktop/ZD1211LnxDrv_2_2_0_0/src/zd1205.o] Error 1
make[3]: *** [_module_/home/emma/Desktop/ZD1211LnxDrv_2_2_0_0] Error 2
make[3]: Leaving directory `/usr/src/linux-headers-2.6.12-10-k7'
make[2]: *** [all] Error 2
make[2]: Leaving directory `/home/emma/Desktop/ZD1211LnxDrv_2_2_0_0'
make[1]: *** [both] Error 2
make[1]: Leaving directory `/home/emma/Desktop/ZD1211LnxDrv_2_2_0_0'
make: *** [all] Error 2
emma@BreezyDown:~/Desktop/ZD1211LnxDrv_2_2_0_0$



Find your next car at Yahoo! Canada Autos