Compile problem

Help
2004-10-25
2013-04-24
  • Marlo Jones

    Marlo Jones - 2004-10-25

    Hi.

    Trying to compile on Slack 10. Bit of a problem :/

    ...[snip]
    ar cru libXw.a Base.o Box.o Button.o Field.o Label.o RootIcon.o simple.o testxw.o Toggle.o
    ranlib libXw.a
    gcc -I/usr/X11R6/include -g -O2 -L/usr/X11R6/lib  -o simple  simple.o libXw.a -lpng -lz  -lXext -lXmu -lXt -lX11
    /usr/lib/gcc-lib/i486-slackware-linux/3.3.4/../../../libpng.so: undefined reference to `pow'
    collect2: ld returned 1 exit status
    make[2]: *** [simple] Error 1
    make[2]: Leaving directory `/root/src/XVidCap/xvidcap-1.1.3/Xw'
    make[1]: *** [all-recursive] Error 1
    make[1]: Leaving directory `/root/src/XVidCap/xvidcap-1.1.3'
    make: *** [all] Error 2

    ?

     
    • Marlo Jones

      Marlo Jones - 2004-10-26

      Oopsie. Yes, there he is in the Bugs.

      Compiled now!

       

Get latest updates about Open Source Projects, Conferences and News.

Sign up for the SourceForge newsletter:





No, thanks