CAP_FFM undeclared (CVS-20050702)

Help
2005-07-02
2013-04-24
  • Nobody/Anonymous

    Would be better with a mailinglist to post this, but it's what I'm getting trying to compile.

    ./configure --with-force-embedded

    make[2]: Entering directory `/src/xvidcap-cvs-20050702/xvidcap/src'
    if gcc -DHAVE_CONFIG_H -I. -I. -I..    -I/usr/X11R6/include -DVERSION=\"1.1.4\"     -g -O2 -MT xvidcap-xt_control.o -MD -MP -MF ".deps/xvidcap-xt_control.Tpo" \   -c -o xvidcap-xt_control.o `test -f 'xt_control.c' || echo './'`xt_control.c; \ then mv -f ".deps/xvidcap-xt_control.Tpo" ".deps/xvidcap-xt_control.Po"; \ else rm -f ".deps/xvidcap-xt_control.Tpo"; exit 1; \ fi
    xt_control.c:110: error: structure has no member named `fps'
    xt_control.c:110: error: initializer element is not constant
    xt_control.c:110: error: (near initialization for `resources[0].resource_offset')
    xt_control.c:110: error: initializer element is not constant
    xt_control.c:110: error: (near initialization for `resources[0]')
    xt_control.c:111: error: structure has no member named `file'
    xt_control.c:111: error: initializer element is not constant
    xt_control.c:111: error: (near initialization for `resources[1].resource_offset')
    xt_control.c:111: error: initializer element is not constant
    xt_control.c:111: error: (near initialization for `resources[1]')
    xt_control.c:112: error: initializer element is not constant
    xt_control.c:112: error: (near initialization for `resources[2]')
    xt_control.c:113: error: initializer element is not constant
    xt_control.c:113: error: (near initialization for `resources[3]')
    xt_control.c:114: error: initializer element is not constant
    xt_control.c:114: error: (near initialization for `resources[4]')
    xt_control.c:115: error: structure has no member named `time'
    xt_control.c:115: error: initializer element is not constant
    xt_control.c:115: error: (near initialization for `resources[5].resource_offset')

    [..] lots of similar output

    xt_control.c:1174: error: too many arguments to function `job_set_save_function'
    xt_control.c:1182: error: `CAP_FFM' undeclared (first use in this function)
    make[2]: *** [xvidcap-xt_control.o] Error 1
    make[2]: Leaving directory `/src/xvidcap-cvs-20050702/xvidcap/src'
    make[1]: *** [all-recursive] Error 1
    make[1]: Leaving directory `/src/xvidcap-cvs-20050702/xvidcap'
    make: *** [all] Error 2

    Any pointers on how to proceed?

    Thank you.

     
    • Nobody/Anonymous

      Sorry, I missed the FAQ entry.

      It compiled fine; now I'm off to play with it;)

       
    • Nobody/Anonymous

      Sorry, it didn't compile fine. I guess 5am is too late. I see there is a mailinglist too;)

      Sorry for wasting bandwidth.

       
    • Karl H. Beckers

      Karl H. Beckers - 2005-07-02

      Now, I'm lost ...

      it did or it didn't compile fine in the end?

      If not, please return with the error messages you're seeing, now.

      Karl.

       

Log in to post a comment.