Error making wv2 under RedHat 8.0

Help
Anonymous
2003-02-02
2003-11-06
  • Anonymous - 2003-02-02

    I have many problem making wv2.
    First problem, resolved running autogen.sh, was a problem with a libtool error.
    Now i have a problem compiling libole2 :

    gcc -DHAVE_CONFIG_H -I. -I. -I../../.. -I../../.. -I../../../src/extra/glib -I../../../src/extra -I. -ansi -W -Wall -pedantic -Wshadow -Wpointer-arith -Wmissing-prototypes -Wwrite-strings -D_XOPEN_SOURCE=500 -D_BSD_SOURCE -O2 -c ms-ole-vba.c -MT ms-ole-vba.lo -MD -MP -MF .deps/ms-ole-vba.TPlo  -fPIC -DPIC -o ms-ole-vba.lo
    In file included from ../../../src/extra/libole2/ms-ole-vba.h:13,
                     from ms-ole-vba.c:12:
    ../../../src/extra/libole2/ms-ole.h:118: warning: declaration of `stat' shadows a global declaration
    /usr/include/sys/stat.h:345: warning: shadowed declaration is here
    ms-ole-vba.c:30: syntax error before "gboolean"
    ms-ole-vba.c: In function `ms_ole_vba_eof':
    ms-ole-vba.c:33: warning: comparison between signed and unsigned
    ms-ole-vba.c: In function `decompress_vba':
    ms-ole-vba.c:206: warning: comparison of unsigned expression >= 0 is always true
    ms-ole-vba.c: In function `seek_sig':
    ms-ole-vba.c:278: warning: comparison between signed and unsigned
    make[4]: *** [ms-ole-vba.lo] Error 1
    make[4]: Leaving directory `/home/paolo/install/wv2/src/extra/libole2'
    make[3]: *** [all-recursive] Error 1
    make[3]: Leaving directory `/home/paolo/install/wv2/src/extra'
    make[2]: *** [all-recursive] Error 1
    make[2]: Leaving directory `/home/paolo/install/wv2/src'
    make[1]: *** [all-recursive] Error 1
    make[1]: Leaving directory `/home/paolo/install/wv2'
    make: *** [all] Error 2

    Some suggestion?

    Thank

     
    • Werner Trobin

      Werner Trobin - 2003-11-06

      Please update to wv2-0.2.1

       

Log in to post a comment.

Get latest updates about Open Source Projects, Conferences and News.

Sign up for the SourceForge newsletter:





No, thanks