Can't MAKE Wired ....

Help
2008-11-29
2013-04-24
  • Arthur Rytas

    Arthur Rytas - 2008-11-29

    Downloaded the tar.gz file for version 0.6 .... Followed the instructions in INSTALL and everything behaved without hitch until right at the end of the MAKE procedure ... where it spits out this complaint ...

    ###########################
    SettingWindow.cpp: In constructor `SettingWindow::SettingWindow()':
    SettingWindow.cpp:69: error: syntax error before `.' token
    SettingWindow.cpp:69: error: syntax error before `)' token
    SettingWindow.cpp:70: error: syntax error before `.' token
    SettingWindow.cpp:70: error: syntax error before `)' token
    SettingWindow.cpp:71: error: syntax error before `.' token
    SettingWindow.cpp:71: error: syntax error before `)' token
    SettingWindow.cpp:72: error: syntax error before `.' token
    SettingWindow.cpp:72: error: syntax error before `)' token
    SettingWindow.cpp:73: error: syntax error before `.' token
    SettingWindow.cpp:73: error: syntax error before `)' token
    make[2]: *** [SettingWindow.o] Error 1
    make[2]: Leaving directory `/home/je/Desktop/wired-0.6/src/gui'
    make[1]: *** [install-recursive] Error 1
    make[1]: Leaving directory `/home/je/Desktop/wired-0.6/src'
    make: *** [install-recursive] Error 1
    ###########################

    Both the ./autogen.sh and ./configure steps worked without error

    here is result of ./configure

    -=-=-=-=-=-=-=-=-=-= Configuration Complete =-=-=-=-=-=-=-=-=-=-=-

      Configuration summary :

        Version : ..................... 0.6
        Enable debugging : ............ No
        Enable optimizations : ........ Yes

       Tools :

         Compiler is GCC : ............. yes
         GCC major version : ........... 4

       Portaudio options :

        Jack : ........................ yes
        OSS : ......................... yes
        ALSA : ........................ yes

    WARNING: If you already have Portaudio in your System, it may be replaced by this one !

      Extra tools required :

        wxWidgets : ................... 2.6.4
        libsamplerate : ............... 0.1.4
        libsndfile : .................. 1.0.18pre20

      Installation directories :
        Wired plugins directory: .............. /usr/local/lib/wired
        Wired binary directory : .............. /usr/local/bin
        Wired data directory   : .............. /usr/local/share
        Wired conf directory   : .............. /usr/local/etc/wired

    =-=-=-=-=-=-=-=-=-=-=-=-=-=-=-=-=-=-=-=-=-=-=-=-=-=-=-=-=-=-=-=-=-

    My Specs are PCLinuxOS release 2008 (PCLinuxOS Gnome) for i586
    Kernel Linux 2.6.22.17.tex2
    GNOME 2.21.2
    Memory 2.0 GiB
    Processor AMD Anthlon XP 3000+

    Any ideas??? ...

    Thank you.

     
    • Doomsday

      Doomsday - 2008-12-06

      Hello,

      I currently in several test to reproduce your error, but I failed.
      wxGTK 2.6 unicode or ansi, all tests passed.

      I don't have any machine on PCLinuxOS, but on mine it's working pretty well.

      Have you tested to fix yourself these lines ? (SettingWindow.cpp:69)

      Thanks for feedback

       

Get latest updates about Open Source Projects, Conferences and News.

Sign up for the SourceForge newsletter:





No, thanks