Hi everyone
    I'd like to build vgui library to support wxWidgets GUI but I got the following compilation and linker errors. I'd be grateful to anyone who can lead me to resolve this issue ?
 
    Sincerely
    Cem DEMiRKIR
 
My Configuration:
VXL : VXL 1.8.0
OS : WinXP SP2
Compiler & IDE : VC++ 8.0 & VS2005
wxWidgets : 2.8.4 
 
 
------ Build started: Project: vgui, Configuration: Debug Win32 ------

Compiling...

vgui_wx.cxx

..\..\..\core\vgui\impl\wx\vgui_wx.cxx(87) : error C3861: 'wxSetInstance': identifier not found

Build log was saved at "file://z:\Libraries\VXL\bin\core\vgui\vgui.dir\Debug\BuildLog.htm"

vgui - 1 error(s), 0 warning(s)

------ Build started: Project: wx_childview_example, Configuration: Debug Win32 ------

Linking...

wx_childview_app.obj : error LNK2019: unresolved external symbol "int __cdecl wxEntry(struct HINSTANCE__ *,struct HINSTANCE__ *,char *,int)" (?wxEntry@@YAHPAUHINSTANCE__@@0PADH@Z) referenced in function _WinMain@16

wx_childview_app.obj : error LNK2019: unresolved external symbol "public: __thiscall wxApp::wxApp(void)" (??0wxApp@@QAE@XZ) referenced in function "public: __thiscall wx_childview_app::wx_childview_app(void)" (??0wx_childview_app@@QAE@XZ)

wx_childview_app.obj : error LNK2001: unresolved external symbol "public: virtual class wxClassInfo * __thiscall wxApp::GetClassInfo(void)const " (?GetClassInfo@wxApp@@UBEPAVwxClassInfo@@XZ)

....

.\Debug\wx_childview_example.exe : fatal error LNK1120: 232 unresolved externals

Build log was saved at "file://z:\Libraries\VXL\bin\core\vgui\examples\wx_example\wx_childview_example.dir\Debug\BuildLog.htm"

wx_childview_example - 233 error(s), 0 warning(s)

------ Build started: Project: wx_docview_example, Configuration: Debug Win32 ------

Linking...

wx_docview_app.obj : error LNK2019: unresolved external symbol "int __cdecl wxEntry(struct HINSTANCE__ *,struct HINSTANCE__ *,char *,int)" (?wxEntry@@YAHPAUHINSTANCE__@@0PADH@Z) referenced in function _WinMain@16

wx_docview_app.obj : error LNK2019: unresolved external symbol "public: __thiscall wxApp::wxApp(void)" (??0wxApp@@QAE@XZ) referenced in function "public: __thiscall wx_docview_app::wx_docview_app(void)" (??0wx_docview_app@@QAE@XZ)

wx_docview_app.obj : error LNK2001: unresolved external symbol "public: virtual class wxClassInfo * __thiscall wxApp::GetClassInfo(void)const " (?GetClassInfo@wxApp@@UBEPAVwxClassInfo@@XZ)

...

.\Debug\wx_docview_example.exe : fatal error LNK1120: 266 unresolved externals

Build log was saved at "file://z:\Libraries\VXL\bin\core\vgui\examples\wx_example\wx_docview_example.dir\Debug\BuildLog.htm"

wx_docview_example - 267 error(s), 0 warning(s)

------ Build started: Project: ALL_BUILD, Configuration: Debug Win32 ------

"Build all projects"

Build log was saved at "file://z:\Libraries\VXL\bin\core\ALL_BUILD.dir\Debug\BuildLog.htm"

ALL_BUILD - 0 error(s), 0 warning(s)

------ Skipped Build: Project: INSTALL, Configuration: Debug Win32 ------

Project not selected to build for this solution configuration

------ Skipped Build: Project: RUN_TESTS, Configuration: Debug Win32 ------

Project not selected to build for this solution configuration

========== Build: 1 succeeded, 3 failed, 167 up-to-date, 2 skipped ==========