#15 make check hangs on OS X

v1.1
closed-works-for-me
Testsuite (6)
5
2002-09-16
2002-07-13
Paul Twohey
No

make check hangs when it gets to the outcheck test cases on
mac os x, I have to abort the test run with ^C. In addition the the
sort test fails.

OS: MacOS X 10.1.5
CPU: G4
HOST-COMPILER:cc -v
Reading specs from /usr/libexec/gcc/darwin/ppc/2.95.2/specs
Apple Computer, Inc. version gcc-934.3, based on gcc version
2.95.2 19991024 (release)
MIPS-COMPILER: mips-gcc -v
Reading specs from /usr/local/mips/lib/gcc-lib/mips/3.0/specs
Configured with: ../gcc-3.0/configure --target=mips --prefix=/usr/
local/mips --with-gnu-as --with-gnu-ld --disable-threads
Thread model: single
gcc version 3.0
VMIPS: 20020710 snapshot
CONFIGURE: a local copy of dis-asm.h, ./configure --with-mips=/
usr/local/mips --prefix=/usr/local/mips, make
EXPECT: version 5.33.0 (this is the version packaged by fink)

--- attempted run log ---
[localhost:~/development/vmips-20020710] twohey% make check
Making check in .
Making check in sample_code
make[1]: Nothing to be done for `check'.
Making check in test_code
Making check in vmips.misc-tests
make[2]: Nothing to be done for `check'.
Making check in vmips.outcheck
make[2]: Nothing to be done for `check'.
Making check in vmips.regcheck
make[2]: Nothing to be done for `check'.
make check-DEJAGNU
srcdir=`cd . && pwd`; export srcdir; \ EXPECT=expect; export EXPECT; \ runtest=runtest; \ if /bin/sh -c "$runtest --version" > /dev/null 2>&1; then \ $runtest --tool vmips --srcdir $srcdir ; \ else echo "WARNING: could not find \`runtest'" 1>&2; :;\ fi
WARNING: Couldn't find the global config file.
Test Run By twohey on Sat Jul 13 12:27:04 2002
Native configuration is powerpc-apple-darwin5.5

=== vmips tests ===

Schedule of variations:
unix

Running target unix
Using /usr/local/share/dejagnu/baseboards/unix.exp as board
description file for target.
Using /usr/local/share/dejagnu/config/unix.exp as generic interface
file for target.
Using /Users/twohey/development/vmips-20020710/test_code/
config/unix.exp as tool-and-target-specific interface file.
Running /Users/twohey/development/vmips-20020710/test_code/
vmips.misc-tests/clocker.exp ...
Running /Users/twohey/development/vmips-20020710/test_code/
vmips.misc-tests/echo.exp ...
Running /Users/twohey/development/vmips-20020710/test_code/
vmips.misc-tests/sort.exp ...
FAIL: /Users/twohey/development/vmips-20020710/test_code/
vmips.misc-tests/sort.exp
Running /Users/twohey/development/vmips-20020710/test_code/
vmips.outcheck/outcheck.exp ...
^Cgot a INT signal, interrupted by user

=== vmips Summary ===

# of expected passes 2
# of unexpected failures 1
vmips version "20020710"

make[3]: *** [check-DEJAGNU] Error 1
make[2]: *** [check-am] Interrupt
make[1]: *** [check-recursive] Interrupt
make: *** [check-recursive] Interrupt

Discussion

  • Paul Twohey

    Paul Twohey - 2002-07-13
    • assigned_to: nobody --> brg
     
  • Brian R. Gaeke

    Brian R. Gaeke - 2002-09-16

    Logged In: YES
    user_id=68040

    Couldn't reproduce this.
    Please try recent versions of Expect/Tcl/Dejagnu e.g.:

    brg@usf-cf-ppc-macosx-1:~/vmips/test_code$ runtest --version
    WARNING: Couldn't find the global config file.
    Expect version is 5.37.2
    Tcl version is 8.3
    Framework version is 1.4.2

     
  • Brian R. Gaeke

    Brian R. Gaeke - 2002-09-16
    • status: open --> closed-works-for-me
     

Get latest updates about Open Source Projects, Conferences and News.

Sign up for the SourceForge newsletter:





No, thanks