tse3-0.0.20 Failed to Compile

Help
2001-01-24
2001-03-14
  • Robert Young

    Robert Young - 2001-01-24

    Has anyone had any luck in compiling the tse3-0.0.20 package?  I have downloaded the package and it failed to compile under my Linux machine, a SuSE-7.0 Pro distro.  The following error messages appeared when compiling the package:

    #####
    creating libtse3.la
    (cd .libs && rm -f libtse3.la && ln -s ../libtse3.la libtse3.la)
    c++ -DHAVE_CONFIG_H -I. -I. -I../.. -I../../src    -g -O2 -W -Wall -ansi -pedantic -c test3.cpp
    /bin/sh ../../libtool --mode=link c++  -g -O2 -W -Wall -ansi -pedantic  -o test
    -L../../src/tse3/.libs -L../../src/tse3/plt/.libs -L../../src/tse3/util/.libs test3.o -ltse3 -ltse3plt -ltse3util
    c++ -g -O2 -W -Wall -ansi -pedantic -o test -L../../src/tse3/.libs -L../../src/tse3/plt/.libs -L../../src/tse3/util/.libs test3.o -ltse3 -ltse3plt -ltse3util
    /usr/i486-suse-linux/bin/ld: cannot find -ltse3plt
    collect2: ld returned 1 exit status
    make[4]: *** [test] Error 1
    make[4]: Leaving directory `/usr/src/packages/BUILD/tse3-0.0.20/src/tse3'
    make[3]: *** [all-recursive] Error 1
    make[3]: Leaving directory `/usr/src/packages/BUILD/tse3-0.0.20/src/tse3'
    make[2]: *** [all-recursive] Error 1
    make[2]: Leaving directory `/usr/src/packages/BUILD/tse3-0.0.20/src'
    make[1]: *** [all-recursive] Error 1
    make[1]: Leaving directory `/usr/src/packages/BUILD/tse3-0.0.20'
    make: *** [all-recursive-am] Error 2
    #####

    I certainly would appreciate any help. TIA.

     
    • Pete Goodliffe

      Pete Goodliffe - 2001-02-20

      The 0.0.20a release that quickly followed 0.0.20 fixes this problem. Does this work?

       
      • Robert Young

        Robert Young - 2001-03-14

        I have downloaded the latest tse3-0.0.22.tar.gz and it compiled OK since.  Thanks for the pointer.

         

Get latest updates about Open Source Projects, Conferences and News.

Sign up for the SourceForge newsletter:





No, thanks