Add a OSX SVN

2012-06-15
2012-10-17
  • Nobody/Anonymous

    Can someone compile an OSX svn. I have noticed activity for windows but not
    for mac. Thanks.

     
  • Tim Hoffmann

    Tim Hoffmann - 2012-06-20

    Currently none of the main developers uses or has regular access to OSX.
    Therefore OSX support is limited. Active contributions (compiling, testing)
    from OSX users are welcome.

     
  • Nobody/Anonymous

    i tried to compile the newest svn on my OSX Lion, but there are too many
    errors.....

    it's failed.

    Is there any some introduction on compiling a SVN on OSX?

     
  • Benito van der Zander

    Which errors do you get?

    It might be that the current svn doesn't compile at all on Mac (see http://so
    urceforge.net/projects/texstudio/forums/forum/907840/topic/5325502)

    It is probably just a missing _ somewhere, but I can't know/fix that
    without the mac headers...

    On 06/24/12 06:40, SourceForge.net wrote:

     
  • Nobody/Anonymous

    I../../QtSDK/Desktop/Qt/4.8.1/gcc/include/QtScript
    -I../../QtSDK/Desktop/Qt/4.8.1/gcc/include -Iqtsingleapplication
    -Iqcodeedit/lib -Iqcodeedit/lib/document -Iqcodeedit/lib/language
    -Iqcodeedit/lib/widgets -Iqcodeedit/lib/qnfa -Iinclude_win32 -I.moc -I.ui
    -F/Users/Jhering/QtSDK/Desktop/Qt/4.8.1/gcc/lib -o .obj/debughelper.o
    debughelper.cpp

    [color=red]debughelper.cpp:386: warning: unused parameter 'title'
    debughelper.cpp:386: warning: unused parameter 'where'
    debughelper.cpp:386: warning: unused parameter 'assertion'
    debughelper.cpp:386: warning: unused parameter 'file'
    debughelper.cpp:386: warning: unused parameter 'line'
    debughelper.cpp: In function 'void registerCrashHandler(int)':
    debughelper.cpp:551: error: 'sigaltstack' was not declared in this scope
    debughelper.cpp:555: error: no matching function for call to 'sigaction::sigaction(int, sigaction*, int)'
    /usr/include/sys/signal.h:303: note: candidates are: sigaction::sigaction()
    /usr/include/sys/signal.h:303: note:                 sigaction::sigaction(const sigaction&)
    debughelper.cpp:556: error: no matching function for call to 'sigaction::sigaction(int, sigaction*, int)'
    /usr/include/sys/signal.h:303: note: candidates are: sigaction::sigaction()
    /usr/include/sys/signal.h:303: note:                 sigaction::sigaction(const sigaction&)
    debughelper.cpp:559: error: no matching function for call to 'sigaction::sigaction(int, sigaction*, int)'
    /usr/include/sys/signal.h:303: note: candidates are: sigaction::sigaction()
    /usr/include/sys/signal.h:303: note:                 sigaction::sigaction(const sigaction&)
    debughelper.cpp:560: error: no matching function for call to 'sigaction::sigaction(int, sigaction*, int)'
    /usr/include/sys/signal.h:303: note: candidates are: sigaction::sigaction()
    /usr/include/sys/signal.h:303: note:                 sigaction::sigaction(const sigaction&)
    debughelper.cpp: In function 'bool recoverMainThreadFromOutside()':
    debughelper.cpp:571: error: redefinition of 'bool recoverMainThreadFromOutside()'
    debughelper.cpp:390: error: 'bool recoverMainThreadFromOutside()' previously defined here
    debughelper.cpp: In function 'void undoMainThreadRecoveringFromOutside()':
    debughelper.cpp:583: error: redefinition of 'void undoMainThreadRecoveringFromOutside()'
    debughelper.cpp:395: error: 'void undoMainThreadRecoveringFromOutside()' previously defined here
    debughelper.cpp: In member function 'void SimulatedCPU::set_all(void*)':
    debughelper.cpp:917: error: 'struct __darwin_ucontext' has no member named '__ss'
    debughelper.cpp:918: error: 'struct __darwin_ucontext' has no member named '__ss'
    debughelper.cpp:919: error: 'struct __darwin_ucontext' has no member named '__ss'
    debughelper.cpp: In member function 'void SimulatedCPU::get_all(void*)':
    debughelper.cpp:925: error: 'struct __darwin_ucontext' has no member named '__ss'
    debughelper.cpp:926: error: 'struct __darwin_ucontext' has no member named '__ss'
    debughelper.cpp:927: error: 'struct __darwin_ucontext' has no member named '__ss'[/color]
    make: *** [.obj/debughelper.o] Error 1
    make: Leaving directory `/Users/Jhering/Downloads/trunk'
    13:41:09: 进程"/usr/bin/make"退出,退出代码 2 。
    构建项目texstudio 时发生错误 (目标: 桌面)
    当执行构建步骤 'Make'
    
     
  • Jhering

    Jhering - 2012-06-25

    Above is these errors.

     
  • Benito van der Zander

    Okay, that are the same errors as in the other posts.

    debughelper.cpp:927: error: 'struct darwin_ucontext' has no member named
    '
    ss'

    That's the one I need more information for, can you post the definition of
    __darwin_ucontext on your system?

    You can probably find it sys/_structs.h now.

    (otherwise grep -A 50 __darwin_ucontext /usr/include/ /usr/include/sys/
    should find it)

     


Anonymous

Cancel  Add attachments





Get latest updates about Open Source Projects, Conferences and News.

Sign up for the SourceForge newsletter:

JavaScript is required for this form.





No, thanks