#46 errors compiling swsusp 2.0.0.44 and 2.4.25-rev1-test15

closed
nobody
compiling (12)
5
2004-04-19
2004-04-14
No

Patching kernel 2.4.26 with software suspend
2.4.25-rev1-test15, core 2.0, incremental patch
2.0.0.44 I receive three rejects, that I was simply
able to manage.
Compiling kernel I receive these errors:

gcc -D__KERNEL__ -I/usr/local/src/linux-2.4.25/include
-Wall -Wstrict-prototypes -Wno-trigraphs -O2
-fno-strict-aliasing -fno-common -fomit-frame-pointer
-pipe -mpreferred-stack-boundary=2 -march=i686
-malign-functions=4 -Os -nostdinc -iwithprefix
include -DKBUILD_BASENAME=system -c -o system.o system.c
system.c: In function `acpi_suspend':
system.c:360: warning: implicit declaration of function
`software_suspend_pending'
In file included from system.c:834:
/usr/local/src/linux-2.4.25/include/linux/suspend.h: In
function `acpi_system_read_alarm':
/usr/local/src/linux-2.4.25/include/linux/suspend.h:13:
parse error before `extern'
make[4]: *** [system.o] Error 1
make[4]: Leaving directory
`/usr/local/src/linux-2.4.25/drivers/acpi'
make[3]: *** [first_rule] Error 2
make[3]: Leaving directory
`/usr/local/src/linux-2.4.25/drivers/acpi'
make[2]: *** [_subdir_acpi] Error 2
make[2]: Leaving directory
`/usr/local/src/linux-2.4.25/drivers'
make[1]: *** [_dir_drivers] Error 2
make[1]: Leaving directory `/usr/local/src/linux-2.4.25'
make: *** [stamp-build] Error 2

Discussion

  • Pino Gargiulo

    Pino Gargiulo - 2004-04-19

    Logged In: YES
    user_id=58753

    Compiling now works with software-suspend core-2.0.0.48 and
    linux-2.4.26-test2.

     
  • Pino Gargiulo

    Pino Gargiulo - 2004-04-19
    • status: open --> closed
     

Log in to post a comment.