Hello list

I tried to compile the Siconos [1] frontend and got the following error message:

  /usr/include/boost/smart_ptr/enable_shared_from_this.hpp:28: Error: Syntax error in input(3).
  make[2]: *** [src/swig/Siconos/KernelPYTHON_wrap.cxx] Error 1
  make[1]: *** [src/swig/Siconos/CMakeFiles/_Kernel.dir/all] Error 2
  make: *** [all] Error 2

The line 28 in enable_shared_from_this.hpp looks like this:

  enable_shared_from_this() BOOST_NOEXCEPT                                  

What is a possible workaround?

Thanks for your help.

Cheers Reza 

[1] http://siconos.gforge.inria.fr/