I have checked out the OPENSSI-FC sources for the 1.9.2 version and wante to compile it under debian

I have copied the build-debian and debian dir to the ci dir of the fc and then called
./scripts/build-debian ci debian

he makes configure wihtout problems but then this error:

ci configuration:
  Version               = 1.9.2
  Distribution          = debian
  Installation Prefix   = /
# Add here command to compile/build the package.
make[1]: Entering directory `/usr/src/BUILD/cluster-tools'
cd . && autoheader
/usr/bin/make  all-recursive
make[2]: Entering directory `/usr/src/BUILD/cluster-tools'
Making all in cluster-tools
make[3]: Entering directory `/usr/src/BUILD/cluster-tools/cluster-tools'
Making all in libcluster
make[4]: Entering directory `/usr/src/BUILD/cluster-tools/cluster-tools/libcluster'
/bin/sh ../../libtool --mode=compile gcc -DHAVE_CONFIG_H -I. -I. -I../..   -I/usr/src/linux/include -Wall -O2 -D_GNU_SOURCE -I/usr/src/linux/include -c ssisys.c
mkdir .libs
 gcc -DHAVE_CONFIG_H -I. -I. -I../.. -I/usr/src/linux/include -Wall -O2 -D_GNU_SOURCE -I/usr/src/linux/include -Wp,-MD,.deps/ssisys.pp -c ssisys.c  -fPIC -DPIC -o .libs/ssisys.o
ssisys.c: In function `ssisys':
ssisys.c:28: error: `__NR_ssisys' undeclared (first use in this function)
ssisys.c:28: error: (Each undeclared identifier is reported only once
ssisys.c:28: error: for each function it appears in.)
make[4]: *** [ssisys.lo] Fehler 1
make[4]: Leaving directory `/usr/src/BUILD/cluster-tools/cluster-tools/libcluster'
make[3]: *** [all-recursive] Fehler 1
make[3]: Leaving directory `/usr/src/BUILD/cluster-tools/cluster-tools'
make[2]: *** [all-recursive] Fehler 1
make[2]: Leaving directory `/usr/src/BUILD/cluster-tools'
make[1]: *** [all-recursive-am] Fehler 2
make[1]: Leaving directory `/usr/src/BUILD/cluster-tools'
make: *** [build-arch-stamp] Fehler 2
debuild: fatal error at line 765:
dpkg-buildpackage failed!

I have also a second question - on my testing of migrating prozesses I have always this error

Mar 17 18:08:58 master kernel: reop_export_path: Can't export unlinked file /SYSV0052e2c1 (deleted)

I only want to migrate prozesses from a runnung app on another node.

I saw there is a posting about this error  - Is that fixed in 1.9.2

Regards Ewald Geschwinde