make problem

Help
2013-08-18
2014-03-16
  • Sahand Mozaffari

    Hi!
    I have problem making rcssserver. rcssmonitor makes and installs just fine, but rcssserver won't make. I am using Arch-linux 64bit.
    Anyony knows how to fix this?
    Here is the output of make command:

    make  all-recursive
    make[1]: Entering directory `/mnt/data/Download/rcssserver-15.2.2'
    Making all in rcssbase
    make[2]: Entering directory `/mnt/data/Download/rcssserver-15.2.2/rcssbase'
    Making all in net
    make[3]: Entering directory `/mnt/data/Download/rcssserver-15.2.2/rcssbase/net'
    make[3]: Nothing to be done for `all'.
    make[3]: Leaving directory `/mnt/data/Download/rcssserver-15.2.2/rcssbase/net'
    Making all in conf
    make[3]: Entering directory `/mnt/data/Download/rcssserver-15.2.2/rcssbase/conf'
    make[3]: Nothing to be done for `all'.
    make[3]: Leaving directory `/mnt/data/Download/rcssserver-15.2.2/rcssbase/conf'
    Making all in gzip
    make[3]: Entering directory `/mnt/data/Download/rcssserver-15.2.2/rcssbase/gzip'
    make[3]: Nothing to be done for `all'.
    make[3]: Leaving directory `/mnt/data/Download/rcssserver-15.2.2/rcssbase/gzip'
    make[3]: Entering directory `/mnt/data/Download/rcssserver-15.2.2/rcssbase'
    make[3]: Nothing to be done for `all-am'.
    make[3]: Leaving directory `/mnt/data/Download/rcssserver-15.2.2/rcssbase'
    make[2]: Leaving directory `/mnt/data/Download/rcssserver-15.2.2/rcssbase'
    Making all in src
    make[2]: Entering directory `/mnt/data/Download/rcssserver-15.2.2/src'
    make  all-am
    make[3]: Entering directory `/mnt/data/Download/rcssserver-15.2.2/src'
    /bin/sh ../libtool --tag=CXX   --mode=compile g++ -DHAVE_CONFIG_H -I. -I..  -I.. -I/usr/include -W -Wall -g -O2 -MT coach_lang_parser.lo -MD -MP -MF .deps/coach_lang_parser.Tpo -c -o coach_lang_parser.lo coach_lang_parser.cpp
    libtool: compile:  g++ -DHAVE_CONFIG_H -I. -I.. -I.. -I/usr/include -W -Wall -g -O2 -MT coach_lang_parser.lo -MD -MP -MF .deps/coach_lang_parser.Tpo -c coach_lang_parser.cpp  -fPIC -DPIC -o .libs/coach_lang_parser.o
    coach_lang_parser.cpp: In function 'int RCSS_CLANG_parse()':
    coach_lang_parser.cpp:1502:30: error: too few arguments to function 'int {anonymous}::RCSS_CLANG_lex(RCSSCLangLexer::Holder*, rcss::clang::Parser::Param&)'
        yychar = yylex (&yylval);
                                ^
    coach_lang_parser.ypp:33:23: note: declared here
    #define    yylex      RCSS_CLANG_lex
                        ^
    coach_lang_parser.ypp:100:3: note: in expansion of macro 'yylex'
    yylex( YYSTYPE* holder, rcss::clang::Parser::Param& param )
    ^                                                                                                                                                                                            
    coach_lang_parser.ypp:111:29: error: 'param' was not declared in this scope                                                                                                                     
    #define BUILDER getBuilder( param )                                                                                                                                                            
                                ^                                                                                                                                                                  
    coach_lang_parser.ypp:241:9: note: in expansion of macro 'BUILDER'                                                                                                                              
            BUILDER.setTime( $3.getInt() );                                                                                                                                                        
            ^                                                                                                                                                                                      
    coach_lang_parser.ypp:111:29: error: 'param' was not declared in this scope                                                                                                                     
    #define BUILDER getBuilder( param )
                                ^
    coach_lang_parser.ypp:260:9: note: in expansion of macro 'BUILDER'
            BUILDER.buildRuleMsg();
            ^
    coach_lang_parser.ypp:111:29: error: 'param' was not declared in this scope
    #define BUILDER getBuilder( param )
                                ^
    coach_lang_parser.ypp:272:9: note: in expansion of macro 'BUILDER'
            BUILDER.buildActivateRules( $2.getBool() );
            ^
    coach_lang_parser.ypp:111:29: error: 'param' was not declared in this scope
    #define BUILDER getBuilder( param )
                                ^
    coach_lang_parser.ypp:280:29: note: in expansion of macro 'BUILDER'
            if ( var.length() > BUILDER.strVarSize() )
                                ^
    coach_lang_parser.ypp:111:29: error: 'param' was not declared in this scope
    #define BUILDER getBuilder( param )
                                ^
    coach_lang_parser.ypp:292:9: note: in expansion of macro 'BUILDER'
            BUILDER.buildRuleIDList();
            ^
    coach_lang_parser.ypp:111:29: error: 'param' was not declared in this scope
    #define BUILDER getBuilder( param )
                                ^
    coach_lang_parser.ypp:296:9: note: in expansion of macro 'BUILDER'
            BUILDER.buildRuleIDListALL();
            ^
    coach_lang_parser.ypp:111:29: error: 'param' was not declared in this scope
    #define BUILDER getBuilder( param )
                                ^
    coach_lang_parser.ypp:304:29: note: in expansion of macro 'BUILDER'
            if ( var.length() > BUILDER.strVarSize() )
                                ^
    coach_lang_parser.ypp:111:29: error: 'param' was not declared in this scope
    #define BUILDER getBuilder( param )
                                ^
    coach_lang_parser.ypp:316:29: note: in expansion of macro 'BUILDER'
            if ( var.length() > BUILDER.strVarSize() )
                                ^
    coach_lang_parser.ypp:111:29: error: 'param' was not declared in this scope
    #define BUILDER getBuilder( param )
                                ^
    coach_lang_parser.ypp:330:9: note: in expansion of macro 'BUILDER'
            BUILDER.buildDelMsg();
            ^
    coach_lang_parser.ypp:111:29: error: 'param' was not declared in this scope
    #define BUILDER getBuilder( param )
                                ^
    coach_lang_parser.ypp:339:9: note: in expansion of macro 'BUILDER'
            BUILDER.buildMetaMsg();
            ^
    coach_lang_parser.ypp:111:29: error: 'param' was not declared in this scope
    #define BUILDER getBuilder( param )
                                ^
    coach_lang_parser.ypp:351:8: note: in expansion of macro 'BUILDER'
            BUILDER.buildMetaTokenVer( $3.getDoub() );
            ^
    coach_lang_parser.ypp:111:29: error: 'param' was not declared in this scope
    #define BUILDER getBuilder( param )
                                ^
    coach_lang_parser.ypp:359:9: note: in expansion of macro 'BUILDER'
            BUILDER.buildDefineMsg();
            ^
    coach_lang_parser.ypp:111:29: error: 'param' was not declared in this scope
    #define BUILDER getBuilder( param )
                                ^
    coach_lang_parser.ypp:372:29: note: in expansion of macro 'BUILDER'
            if ( str.length() > BUILDER.strVarSize() )
                                ^
    coach_lang_parser.ypp:111:29: error: 'param' was not declared in this scope
    #define BUILDER getBuilder( param )
                                ^
    coach_lang_parser.ypp:384:29: note: in expansion of macro 'BUILDER'
            if ( str.length() > BUILDER.strVarSize() )
                                ^
    coach_lang_parser.ypp:111:29: error: 'param' was not declared in this scope
    #define BUILDER getBuilder( param )
                                ^
    coach_lang_parser.ypp:396:29: note: in expansion of macro 'BUILDER'
            if ( str.length() > BUILDER.strVarSize() )
                                ^
    coach_lang_parser.ypp:111:29: error: 'param' was not declared in this scope
    #define BUILDER getBuilder( param )
                                ^
    coach_lang_parser.ypp:408:29: note: in expansion of macro 'BUILDER'
            if ( str.length() > BUILDER.strVarSize() )
                                ^
    coach_lang_parser.ypp:111:29: error: 'param' was not declared in this scope
    #define BUILDER getBuilder( param )
                                ^
    coach_lang_parser.ypp:419:9: note: in expansion of macro 'BUILDER'
            BUILDER.setVer( 8 );
            ^
    coach_lang_parser.ypp:111:29: error: 'param' was not declared in this scope
    #define BUILDER getBuilder( param )
                                ^
    coach_lang_parser.ypp:427:29: note: in expansion of macro 'BUILDER'
            if ( var.length() > BUILDER.strVarSize() )
                                ^
    coach_lang_parser.ypp:111:29: error: 'param' was not declared in this scope
    #define BUILDER getBuilder( param )
                                ^
    coach_lang_parser.ypp:439:29: note: in expansion of macro 'BUILDER'
            if ( var.length() > BUILDER.strVarSize() )
                                ^
    coach_lang_parser.ypp:111:29: error: 'param' was not declared in this scope
    #define BUILDER getBuilder( param )
                                ^
    coach_lang_parser.ypp:453:9: note: in expansion of macro 'BUILDER'
            BUILDER.buildSimpleRule();
            ^
    coach_lang_parser.ypp:111:29: error: 'param' was not declared in this scope
    #define BUILDER getBuilder( param )
                                ^
    coach_lang_parser.ypp:457:9: note: in expansion of macro 'BUILDER'
            BUILDER.buildNestedRule();
            ^
    coach_lang_parser.ypp:111:29: error: 'param' was not declared in this scope
    #define BUILDER getBuilder( param )
                                ^
    coach_lang_parser.ypp:461:9: note: in expansion of macro 'BUILDER'
            BUILDER.buildIDRule();
            ^
    coach_lang_parser.ypp:111:29: error: 'param' was not declared in this scope
    #define BUILDER getBuilder( param )
                                ^
    coach_lang_parser.ypp:474:28: note: in expansion of macro 'BUILDER'
            if( str.length() > BUILDER.freeformMsgSize() )
                                ^
    coach_lang_parser.ypp:111:29: error: 'param' was not declared in this scope
    #define BUILDER getBuilder( param )
                                ^
    coach_lang_parser.ypp:490:9: note: in expansion of macro 'BUILDER'
            BUILDER.buildUnsuppMsg();
            ^
    coach_lang_parser.ypp:111:29: error: 'param' was not declared in this scope
    #define BUILDER getBuilder( param )
                                ^
    coach_lang_parser.ypp:498:9: note: in expansion of macro 'BUILDER'
            BUILDER.buildInfoMsg();
            ^
    coach_lang_parser.ypp:111:29: error: 'param' was not declared in this scope
    #define BUILDER getBuilder( param )
                                ^
    coach_lang_parser.ypp:506:9: note: in expansion of macro 'BUILDER'
            BUILDER.buildAdviceMsg();
            ^
    coach_lang_parser.ypp:111:29: error: 'param' was not declared in this scope
    #define BUILDER getBuilder( param )
                                ^
    coach_lang_parser.ypp:514:9: note: in expansion of macro 'BUILDER'
            BUILDER.buildTokenRule( $2.getInt() );
            ^
    coach_lang_parser.ypp:111:29: error: 'param' was not declared in this scope
    #define BUILDER getBuilder( param )
                                ^
    coach_lang_parser.ypp:518:9: note: in expansion of macro 'BUILDER'
            BUILDER.buildTokenClear();
            ^
    coach_lang_parser.ypp:111:29: error: 'param' was not declared in this scope
    #define BUILDER getBuilder( param )
                                ^
    coach_lang_parser.ypp:529:9: note: in expansion of macro 'BUILDER'
            BUILDER.buildActPos();
            ^
    coach_lang_parser.ypp:111:29: error: 'param' was not declared in this scope
    #define BUILDER getBuilder( param )
                                ^
    coach_lang_parser.ypp:533:9: note: in expansion of macro 'BUILDER'
            BUILDER.buildActHome();
            ^
    coach_lang_parser.ypp:111:29: error: 'param' was not declared in this scope
    #define BUILDER getBuilder( param )
                                ^
    coach_lang_parser.ypp:537:9: note: in expansion of macro 'BUILDER'
            BUILDER.buildActBallToReg();
            ^
    coach_lang_parser.ypp:111:29: error: 'param' was not declared in this scope
    #define BUILDER getBuilder( param )
                                ^
    coach_lang_parser.ypp:541:9: note: in expansion of macro 'BUILDER'
            BUILDER.buildActBallToPlayer();
            ^
    coach_lang_parser.ypp:111:29: error: 'param' was not declared in this scope
    #define BUILDER getBuilder( param )
                                ^
    coach_lang_parser.ypp:545:9: note: in expansion of macro 'BUILDER'
            BUILDER.buildActMark();
            ^
    coach_lang_parser.ypp:111:29: error: 'param' was not declared in this scope
    #define BUILDER getBuilder( param )
                                ^
    coach_lang_parser.ypp:549:9: note: in expansion of macro 'BUILDER'
            BUILDER.buildActMarkLinePlayer();
            ^
    coach_lang_parser.ypp:111:29: error: 'param' was not declared in this scope
    #define BUILDER getBuilder( param )
                                ^
    coach_lang_parser.ypp:553:9: note: in expansion of macro 'BUILDER'
            BUILDER.buildActMarkLineReg();
            ^
    coach_lang_parser.ypp:111:29: error: 'param' was not declared in this scope
    #define BUILDER getBuilder( param )
                                ^
    coach_lang_parser.ypp:557:9: note: in expansion of macro 'BUILDER'
            BUILDER.buildActOffsideLine();
            ^
    coach_lang_parser.ypp:111:29: error: 'param' was not declared in this scope
    #define BUILDER getBuilder( param )
                                ^
    coach_lang_parser.ypp:561:9: note: in expansion of macro 'BUILDER'
            BUILDER.buildActHetType( $3.getInt() );
            ^
    coach_lang_parser.ypp:111:29: error: 'param' was not declared in this scope
    #define BUILDER getBuilder( param )
                                ^
    coach_lang_parser.ypp:566:29: note: in expansion of macro 'BUILDER'
            if ( str.length() > BUILDER.strVarSize() )
                                ^
    coach_lang_parser.ypp:111:29: error: 'param' was not declared in this scope
    #define BUILDER getBuilder( param )
                                ^
    coach_lang_parser.ypp:577:9: note: in expansion of macro 'BUILDER'
            BUILDER.buildActPassReg();
            ^
    coach_lang_parser.ypp:111:29: error: 'param' was not declared in this scope
    #define BUILDER getBuilder( param )
                                ^
    coach_lang_parser.ypp:582:9: note: in expansion of macro 'BUILDER'
            BUILDER.buildActPassUNum();
            ^
    coach_lang_parser.ypp:111:29: error: 'param' was not declared in this scope
    #define BUILDER getBuilder( param )
                                ^
    coach_lang_parser.ypp:587:9: note: in expansion of macro 'BUILDER'
            BUILDER.buildActDribble();
            ^
    coach_lang_parser.ypp:111:29: error: 'param' was not declared in this scope
    #define BUILDER getBuilder( param )
                                ^
    coach_lang_parser.ypp:592:9: note: in expansion of macro 'BUILDER'
            BUILDER.buildActClear();
            ^
    coach_lang_parser.ypp:111:29: error: 'param' was not declared in this scope
    #define BUILDER getBuilder( param )
                                ^
    coach_lang_parser.ypp:597:9: note: in expansion of macro 'BUILDER'
            BUILDER.buildActShoot();
            ^
    coach_lang_parser.ypp:111:29: error: 'param' was not declared in this scope
    #define BUILDER getBuilder( param )
                                ^
    coach_lang_parser.ypp:602:9: note: in expansion of macro 'BUILDER'
            BUILDER.buildActHold();
            ^
    coach_lang_parser.ypp:111:29: error: 'param' was not declared in this scope
    #define BUILDER getBuilder( param )
                                ^
    coach_lang_parser.ypp:607:9: note: in expansion of macro 'BUILDER'
            BUILDER.buildActIntercept();
            ^
    coach_lang_parser.ypp:111:29: error: 'param' was not declared in this scope
    #define BUILDER getBuilder( param )
                                ^
    coach_lang_parser.ypp:612:9: note: in expansion of macro 'BUILDER'
            BUILDER.buildActTackle();
            ^
    coach_lang_parser.ypp:111:29: error: 'param' was not declared in this scope
    #define BUILDER getBuilder( param )
                                ^
    coach_lang_parser.ypp:620:9: note: in expansion of macro 'BUILDER'
            BUILDER.buildDirComm( $2.getBool(), $3.getBool() );
            ^
    coach_lang_parser.ypp:111:29: error: 'param' was not declared in this scope
    #define BUILDER getBuilder( param )
                                ^
    coach_lang_parser.ypp:625:29: note: in expansion of macro 'BUILDER'
            if ( str.length() > BUILDER.strVarSize() )
                                ^
    coach_lang_parser.ypp:111:29: error: 'param' was not declared in this scope
    #define BUILDER getBuilder( param )
                                ^
    coach_lang_parser.ypp:648:9: note: in expansion of macro 'BUILDER'
            BUILDER.buildCondTrue();
            ^
    coach_lang_parser.ypp:111:29: error: 'param' was not declared in this scope
    #define BUILDER getBuilder( param )
                                ^
    coach_lang_parser.ypp:652:9: note: in expansion of macro 'BUILDER'
            BUILDER.buildCondFalse();
            ^
    coach_lang_parser.ypp:111:29: error: 'param' was not declared in this scope
    #define BUILDER getBuilder( param )
                                ^
    coach_lang_parser.ypp:657:9: note: in expansion of macro 'BUILDER'
            BUILDER.buildCondPlayerPos( $3.getBool(), $5.getInt(), $6.getInt() );
            ^
    coach_lang_parser.ypp:111:29: error: 'param' was not declared in this scope
    #define BUILDER getBuilder( param )
                                ^
    coach_lang_parser.ypp:661:9: note: in expansion of macro 'BUILDER'
            BUILDER.buildCondBallPos();
            ^
    coach_lang_parser.ypp:111:29: error: 'param' was not declared in this scope
    #define BUILDER getBuilder( param )
                                ^
    coach_lang_parser.ypp:665:9: note: in expansion of macro 'BUILDER'
            BUILDER.buildCondBallOwner( $3.getBool() );
            ^
    coach_lang_parser.ypp:111:29: error: 'param' was not declared in this scope
    #define BUILDER getBuilder( param )
                                ^
    coach_lang_parser.ypp:669:10: note: in expansion of macro 'BUILDER'
            BUILDER.buildCondPlayMode( $3.getPM() );
            ^
    coach_lang_parser.ypp:111:29: error: 'param' was not declared in this scope
    #define BUILDER getBuilder( param )
                                ^
    coach_lang_parser.ypp:673:10: note: in expansion of macro 'BUILDER'
            BUILDER.buildCondAnd();
            ^
    coach_lang_parser.ypp:111:29: error: 'param' was not declared in this scope
    #define BUILDER getBuilder( param )
                                ^
    coach_lang_parser.ypp:677:9: note: in expansion of macro 'BUILDER'
            BUILDER.buildCondOr();
            ^
    coach_lang_parser.ypp:111:29: error: 'param' was not declared in this scope
    #define BUILDER getBuilder( param )
                                ^
    coach_lang_parser.ypp:681:9: note: in expansion of macro 'BUILDER'
            BUILDER.buildCondNot();
            ^
    coach_lang_parser.ypp:111:29: error: 'param' was not declared in this scope
    #define BUILDER getBuilder( param )
                                ^
    coach_lang_parser.ypp:686:29: note: in expansion of macro 'BUILDER'
            if ( str.length() > BUILDER.strVarSize() )
                                ^
    coach_lang_parser.ypp:111:29: error: 'param' was not declared in this scope
    #define BUILDER getBuilder( param )
                                ^
    coach_lang_parser.ypp:693:9: note: in expansion of macro 'BUILDER'
            BUILDER.setVer( 8 );
            ^
    coach_lang_parser.ypp:111:29: error: 'param' was not declared in this scope
    #define BUILDER getBuilder( param )
                                ^
    coach_lang_parser.ypp:698:29: note: in expansion of macro 'BUILDER'
            if ( var.length() > BUILDER.strVarSize() )
                                ^
    coach_lang_parser.ypp:111:29: error: 'param' was not declared in this scope
    #define BUILDER getBuilder( param )
                                ^
    coach_lang_parser.ypp:709:29: note: in expansion of macro 'BUILDER'
            if ( str.length() > BUILDER.strVarSize() )
                                ^
    coach_lang_parser.ypp:111:29: error: 'param' was not declared in this scope
    #define BUILDER getBuilder( param )
                                ^
    coach_lang_parser.ypp:728:9: note: in expansion of macro 'BUILDER'
            BUILDER.buildCondTime( $3.getInt(), $2.getCompOp() );
            ^
    coach_lang_parser.ypp:111:29: error: 'param' was not declared in this scope
    #define BUILDER getBuilder( param )
                                ^
    coach_lang_parser.ypp:732:9: note: in expansion of macro 'BUILDER'
            BUILDER.buildCondTime( $1.getInt(), $2.getCompOp().swap() );
            ^
    coach_lang_parser.ypp:111:29: error: 'param' was not declared in this scope
    #define BUILDER getBuilder( param )
                                ^
    coach_lang_parser.ypp:739:9: note: in expansion of macro 'BUILDER'
            BUILDER.buildCondOppGoal( $3.getInt(), $2.getCompOp() );
            ^
    coach_lang_parser.ypp:111:29: error: 'param' was not declared in this scope
    #define BUILDER getBuilder( param )
                                ^
    coach_lang_parser.ypp:743:9: note: in expansion of macro 'BUILDER'
            BUILDER.buildCondOppGoal( $1.getInt(), $2.getCompOp().swap() );
            ^
    coach_lang_parser.ypp:111:29: error: 'param' was not declared in this scope
    #define BUILDER getBuilder( param )
                                ^
    coach_lang_parser.ypp:750:9: note: in expansion of macro 'BUILDER'
            BUILDER.buildCondOurGoal( $3.getInt(), $2.getCompOp() );
            ^
    coach_lang_parser.ypp:111:29: error: 'param' was not declared in this scope
    #define BUILDER getBuilder( param )
                                ^
    coach_lang_parser.ypp:754:9: note: in expansion of macro 'BUILDER'
            BUILDER.buildCondOurGoal( $1.getInt(), $2.getCompOp().swap() );
            ^
    coach_lang_parser.ypp:111:29: error: 'param' was not declared in this scope
    #define BUILDER getBuilder( param )
                                ^
    coach_lang_parser.ypp:761:9: note: in expansion of macro 'BUILDER'
            BUILDER.buildCondGoalDiff( $3.getInt(), $2.getCompOp() );
            ^
    coach_lang_parser.ypp:111:29: error: 'param' was not declared in this scope
    #define BUILDER getBuilder( param )
                                ^
    coach_lang_parser.ypp:765:9: note: in expansion of macro 'BUILDER'
            BUILDER.buildCondGoalDiff( $1.getInt(), $2.getCompOp().swap() );
            ^
    coach_lang_parser.ypp:111:29: error: 'param' was not declared in this scope
    #define BUILDER getBuilder( param )
                                ^
    coach_lang_parser.ypp:776:8: note: in expansion of macro 'BUILDER'
            BUILDER.buildAddToCondList();
            ^
    coach_lang_parser.ypp:111:29: error: 'param' was not declared in this scope
    #define BUILDER getBuilder( param )
                                ^
    coach_lang_parser.ypp:780:9: note: in expansion of macro 'BUILDER'
            BUILDER.buildCreateCondList();
            ^
    coach_lang_parser.ypp:111:29: error: 'param' was not declared in this scope
    #define BUILDER getBuilder( param )
                                ^
    coach_lang_parser.ypp:787:9: note: in expansion of macro 'BUILDER'
            BUILDER.buildRegNull();
            ^
    coach_lang_parser.ypp:111:29: error: 'param' was not declared in this scope
    #define BUILDER getBuilder( param )
                                ^
    coach_lang_parser.ypp:791:9: note: in expansion of macro 'BUILDER'
            BUILDER.buildRegQuad();
            ^
    coach_lang_parser.ypp:111:29: error: 'param' was not declared in this scope
    #define BUILDER getBuilder( param )
                                ^
    coach_lang_parser.ypp:796:9: note: in expansion of macro 'BUILDER'
            BUILDER.buildRegArc( $4.getDoub(),
            ^
    coach_lang_parser.ypp:111:29: error: 'param' was not declared in this scope
    #define BUILDER getBuilder( param )
                                ^
    coach_lang_parser.ypp:803:9: note: in expansion of macro 'BUILDER'
            BUILDER.buildRegUnion();
            ^
    coach_lang_parser.ypp:111:29: error: 'param' was not declared in this scope
    #define BUILDER getBuilder( param )
                                ^
    coach_lang_parser.ypp:808:29: note: in expansion of macro 'BUILDER'
            if ( str.length() > BUILDER.strVarSize() )
                                ^
    coach_lang_parser.ypp:111:29: error: 'param' was not declared in this scope
    #define BUILDER getBuilder( param )
                                ^
    coach_lang_parser.ypp:819:9: note: in expansion of macro 'BUILDER'
            BUILDER.buildRegPoint();
            ^
    coach_lang_parser.ypp:111:29: error: 'param' was not declared in this scope
    #define BUILDER getBuilder( param )
                                ^
    coach_lang_parser.ypp:823:9: note: in expansion of macro 'BUILDER'
            BUILDER.buildRegTri();
            ^
    coach_lang_parser.ypp:111:29: error: 'param' was not declared in this scope
    #define BUILDER getBuilder( param )
                                ^
    coach_lang_parser.ypp:828:9: note: in expansion of macro 'BUILDER'
            BUILDER.buildRegRec();
            ^
    coach_lang_parser.ypp:111:29: error: 'param' was not declared in this scope
    #define BUILDER getBuilder( param )
                                ^
    coach_lang_parser.ypp:841:9: note: in expansion of macro 'BUILDER'
            BUILDER.buildPointSimple( $3.getDoub(), $4.getDoub() );
            ^
    coach_lang_parser.ypp:111:29: error: 'param' was not declared in this scope
    #define BUILDER getBuilder( param )
                                ^
    coach_lang_parser.ypp:845:9: note: in expansion of macro 'BUILDER'
            BUILDER.buildPointRel( $3.getDoub(), $4.getDoub() );
            ^
    coach_lang_parser.ypp:111:29: error: 'param' was not declared in this scope
    #define BUILDER getBuilder( param )
                                ^
    coach_lang_parser.ypp:849:9: note: in expansion of macro 'BUILDER'
            BUILDER.buildPointBall();
            ^
    coach_lang_parser.ypp:111:29: error: 'param' was not declared in this scope
    #define BUILDER getBuilder( param )
                                ^
    coach_lang_parser.ypp:853:9: note: in expansion of macro 'BUILDER'
            BUILDER.buildPointPlayer( $3.getBool(),
            ^
    coach_lang_parser.ypp:111:29: error: 'param' was not declared in this scope
    #define BUILDER getBuilder( param )
                                ^
    coach_lang_parser.ypp:859:29: note: in expansion of macro 'BUILDER'
            if ( var.length() > BUILDER.strVarSize() )
                                ^
    coach_lang_parser.ypp:111:29: error: 'param' was not declared in this scope
    #define BUILDER getBuilder( param )
                                ^
    coach_lang_parser.ypp:871:29: note: in expansion of macro 'BUILDER'
            if ( str.length() > BUILDER.strVarSize() )
                                ^
    coach_lang_parser.ypp:111:29: error: 'param' was not declared in this scope
    #define BUILDER getBuilder( param )
                                ^
    coach_lang_parser.ypp:890:9: note: in expansion of macro 'BUILDER'
            BUILDER.buildPointArith( $2.getArithOp() );
            ^
    coach_lang_parser.ypp:111:29: error: 'param' was not declared in this scope
    #define BUILDER getBuilder( param )
                                ^
    coach_lang_parser.ypp:895:9: note: in expansion of macro 'BUILDER'
            BUILDER.buildPointArith( $2.getArithOp() );
            ^
    coach_lang_parser.ypp:111:29: error: 'param' was not declared in this scope
    #define BUILDER getBuilder( param )
                                ^
    coach_lang_parser.ypp:900:9: note: in expansion of macro 'BUILDER'
            BUILDER.buildPointArith( $2.getArithOp() );
            ^
    coach_lang_parser.ypp:111:29: error: 'param' was not declared in this scope
    #define BUILDER getBuilder( param )
                                ^
    coach_lang_parser.ypp:905:9: note: in expansion of macro 'BUILDER'
            BUILDER.buildPointArith( $2.getArithOp() );
            ^
    coach_lang_parser.ypp:111:29: error: 'param' was not declared in this scope
    #define BUILDER getBuilder( param )
                                ^
    coach_lang_parser.ypp:928:9: note: in expansion of macro 'BUILDER'
            BUILDER.buildUNumSet();
            ^
    coach_lang_parser.ypp:111:29: error: 'param' was not declared in this scope
    #define BUILDER getBuilder( param )
                                ^
    coach_lang_parser.ypp:939:9: note: in expansion of macro 'BUILDER'
            BUILDER.buildUNum( rcss::clang::UNum( ( rcss::clang::UNum::unum_t )$1.getInt() ) );
            ^
    coach_lang_parser.ypp:111:29: error: 'param' was not declared in this scope
    #define BUILDER getBuilder( param )
                                ^
    coach_lang_parser.ypp:944:29: note: in expansion of macro 'BUILDER'
            if ( var.length() > BUILDER.strVarSize() )
                                ^
    coach_lang_parser.ypp:111:29: error: 'param' was not declared in this scope
    #define BUILDER getBuilder( param )
                                ^
    coach_lang_parser.ypp:957:29: note: in expansion of macro 'BUILDER'
            if ( str.length() > BUILDER.strVarSize() )
                                ^
    coach_lang_parser.ypp:111:29: error: 'param' was not declared in this scope
    #define BUILDER getBuilder( param )
                                ^
    coach_lang_parser.ypp:975:9: note: in expansion of macro 'BUILDER'
            BUILDER.buildBallMoveToken( $2.getBMT() );
            ^
    coach_lang_parser.ypp:111:29: error: 'param' was not declared in this scope
    #define BUILDER getBuilder( param )
                                ^
    coach_lang_parser.ypp:979:9: note: in expansion of macro 'BUILDER'
            BUILDER.buildBallMoveToken( $1.getBMT() );
            ^
    make[3]: *** [coach_lang_parser.lo] Error 1
    make[3]: Leaving directory `/mnt/data/Download/rcssserver-15.2.2/src'
    make[2]: *** [all] Error 2
    make[2]: Leaving directory `/mnt/data/Download/rcssserver-15.2.2/src'
    make[1]: *** [all-recursive] Error 1
    make[1]: Leaving directory `/mnt/data/Download/rcssserver-15.2.2'
    make: *** [all] Error 2
    
     
    Last edit: Sahand Mozaffari 2013-08-29
    • Sandor Nagy

      Sandor Nagy - 2014-03-16

      Hi! I had exactly same problem a few days ago.

      Solution: You need install bison27 package from AUR (that will downgrade your current bison version (3.x) to 2.7.x).

       

Log in to post a comment.

Get latest updates about Open Source Projects, Conferences and News.

Sign up for the SourceForge newsletter:

JavaScript is required for this form.





No, thanks