#200 errors_test.h missing from git

closed
nobody
None
5
2012-05-08
2012-01-30
No

errors_test.cpp is there. errors_test.h is not.

g++ -DHAVE_CONFIG_H -I. -I../../tsk3 -I../.. -Wall -I/usr/local/include -g -O2 -c -o errors_test.o errors_test.cpp
errors_test.cpp:23:25: error: errors_test.h: No such file or directory
errors_test.cpp:26: error: expected constructor, destructor, or type conversion before ‘(’ token
errors_test.cpp:28: error: ‘ErrorsTest’ has not been declared
errors_test.cpp:29: error: ‘ErrorsTest’ has not been declared
errors_test.cpp:31: error: ‘ErrorsTest’ has not been declared
errors_test.cpp: In function ‘void testInitialState()’:
errors_test.cpp:35: error: ‘CPPUNIT_ASSERT’ was not declared in this scope
errors_test.cpp: At global scope:
errors_test.cpp:40: error: ‘ErrorsTest’ has not been declared
errors_test.cpp: In function ‘void testLengthChecks()’:
errors_test.cpp:50: error: ‘CPPUNIT_ASSERT’ was not declared in this scope
errors_test.cpp: At global scope:
errors_test.cpp:115: error: ‘ErrorsTest’ has not been declared
errors_test.cpp: In function ‘void testMultithreaded()’:
errors_test.cpp:125: error: ‘CPPUNIT_FAIL’ was not declared in this scope
errors_test.cpp:139: error: ‘CPPUNIT_FAIL’ was not declared in this scope
errors_test.cpp:146: error: ‘CPPUNIT_FAIL’ was not declared in this scope
errors_test.cpp:152: error: ‘CPPUNIT_FAIL’ was not declared in this scope
errors_test.cpp:167: error: ‘CPPUNIT_ASSERT’ was not declared in this scope
errors_test.cpp:175: error: ‘CPPUNIT_FAIL’ was not declared in this scope
errors_test.cpp:188: error: ‘CPPUNIT_FAIL’ was not declared in this scope
make: *** [errors_test.o] Error 1

Discussion

  • Brian Carrier

    Brian Carrier - 2012-05-08

    This was fixed.

     
  • Brian Carrier

    Brian Carrier - 2012-05-08
    • status: open --> closed
     

Log in to post a comment.