|
From: W E. W. <wew...@gm...> - 2006-07-13 16:09:17
|
Dear all,
Getting compilation errors on Kubuntu 6.0.6 with gcc 4.0.3
then mv -f ".deps/odeConstruct.Tpo" ".deps/odeConstruct.Po";
else rm -f ".deps/odeConstruct.Tpo"; exit 1; fi
if gcc -DHAVE_CONFIG_H -I. -I. -I../src/sbmlsolver
-I/home/witek/opt/sundials/include
-I/home/witek/opt/libsbml2.3.4/include
-I/home/witek/opt/libsbml2.3.4/include/sbml
-I/home/witek/opt/libsbml2.3.4/include
-I/home/witek/opt/libsbml2.3.4/include/sbml/sbml -I. -MT
odeModel.o -MD -MP -MF ".deps/odeModel.Tpo" -c -o odeModel.o
odeModel.c; \
then mv -f ".deps/odeModel.Tpo" ".deps/odeModel.Po"; else rm
-f ".deps/odeModel.Tpo"; exit 1; fi
odeModel.c: In function 'ODEModel_computeAssignmentRuleSets':
odeModel.c:417: warning: passing argument 1 of 'ASTNode_getSymbols'
discards qualifiers from pointer target type
odeModel.c:424: warning: passing argument 1 of 'ASTNode_getSymbols'
discards qualifiers from pointer target type
odeModel.c:426: warning: passing argument 2 of 'List_add' discards
qualifiers from pointer target type
odeModel.c: In function 'ODEModel_createFromFileWithObservables':
odeModel.c:744: warning: passing argument 1 of 'parseModel' discards
qualifiers from pointer target type
if gcc -DHAVE_CONFIG_H -I. -I. -I../src/sbmlsolver
-I/home/witek/opt/sundials/include
-I/home/witek/opt/libsbml2.3.4/include
-I/home/witek/opt/libsbml2.3.4/include/sbml
-I/home/witek/opt/libsbml2.3.4/include
-I/home/witek/opt/libsbml2.3.4/include/sbml/sbml -I. -MT
odeSolver.o -MD -MP -MF ".deps/odeSolver.Tpo" -c -o odeSolver.o
odeSolver.c; \
then mv -f ".deps/odeSolver.Tpo" ".deps/odeSolver.Po"; else rm
-f ".deps/odeSolver.Tpo"; exit 1; fi
if gcc -DHAVE_CONFIG_H -I. -I. -I../src/sbmlsolver
-I/home/witek/opt/sundials/include
-I/home/witek/opt/libsbml2.3.4/include
-I/home/witek/opt/libsbml2.3.4/include/sbml
-I/home/witek/opt/libsbml2.3.4/include
-I/home/witek/opt/libsbml2.3.4/include/sbml/sbml -I. -MT
processAST.o -MD -MP -MF ".deps/processAST.Tpo" -c -o processAST.o
processAST.c; \
then mv -f ".deps/processAST.Tpo" ".deps/processAST.Po"; else
rm -f ".deps/processAST.Tpo"; exit 1; fi
processAST.c:69: error: static declaration of 'acosh' follows
non-static declaration
processAST.c:74: error: static declaration of 'asinh' follows
non-static declaration
processAST.c:79: error: static declaration of 'atanh' follows
non-static declaration
make[1]: *** [processAST.o] Error 1
make[1]: Leaving directory
`/home/witek/devel/cpp/odesolver/sos3/SBML_odeSolver/src'
make: *** [all-recursive] Error 1
Any suggestions
Eryk
|