Tranfuga - 2008-02-26

when I apply the path to the 2.6.2 version of the kernel, the module doesn't get compiled.
Message:

CC [M]  security/realtime.o
security/realtime.c: In function 'realtime_exit':
security/realtime.c:128: error: implicit declaration of function 'mod_unreg_security'
security/realtime.c:132: error: implicit declaration of function 'unregister_security'
make[1]: *** [security/realtime.o] Error 1
make: *** [security] Error 2

how can I fix this?