omfgppc - 2009-03-16

mariussss wrote: Hi,

I have this problem:
[code:1:044e0a1828]
i:\\Qt\\2009.01\\mingw\\bin\\..\\lib\\gcc\\mingw32\\3.4.5\\..\\..\\..\\..\\mingw32\\bin\\ld.exe: cannot find -lwrtembed
collect2: ld returned 1 exit status
mingw32-make[2]: *** [i:\\Qt\\2009.01\\qt\\plugins\\designer\\xtuplewidgets.dll] Error 1
mingw32-make[1]: *** [debug] Error 2
mingw32-make: *** [sub-widgets-dll-pro-sub_Debug_ordered] Error 2
Exited with code 2.
Error while building project xtuple
When executing build step ''Make''
[/code:1:044e0a1828]
Any suggestions?

Thanks[/code] -- Read more at http://www.xtuple.org/phpBB2/viewtopic.php?t=3421