Content-type: multipart/mixed; boundary="Boundary_(ID_ryHHj5p0PoQ2tORnQum00g)" --Boundary_(ID_ryHHj5p0PoQ2tORnQum00g) Content-type: text/html; charset=us-ascii Content-transfer-encoding: 7bit --Boundary_(ID_ryHHj5p0PoQ2tORnQum00g) Content-type: application/octet-stream; name="cmake.out" Content-transfer-encoding: 7bit Content-disposition: attachment; filename=cmake.out -- The C compiler identification is GNU -- Check for working C compiler: /usr/bin/gcc -- Check for working C compiler: /usr/bin/gcc -- works -- Detecting C compiler ABI info -- Detecting C compiler ABI info - done -- CMake version = 2.6.4 -- Checking whether system has ANSI C header files -- Looking for include files StandardHeadersExist -- Looking for include files StandardHeadersExist - found -- Performing Test memchrExists -- Performing Test memchrExists - Success -- Performing Test freeExists -- Performing Test freeExists - Success -- Check for whether ctype.h macros work on characters with the high bit set. -- High-bit characters - work -- ANSI C header files - found -- Looking for include files PL_HAVE_UNISTD_H -- Looking for include files PL_HAVE_UNISTD_H - found -- Looking for include files HAVE_TERMIOS_H -- Looking for include files HAVE_TERMIOS_H - found -- Looking for include files PL_HAVE_STDINT_H -- Looking for include files PL_HAVE_STDINT_H - found -- Performing Test HAVE_SYS_WAIT_H -- Performing Test HAVE_SYS_WAIT_H - Success -- Looking for DIR in sys/types.h;dirent.h -- Looking for DIR in sys/types.h;dirent.h - found -- Check for signal return type in -- Check for signal handler return type type void - found -- Looking for popen -- Looking for popen - found -- Looking for usleep -- Looking for usleep - found -- Looking for finite -- Looking for finite - found -- Looking for isnan -- Looking for isnan - found -- Looking for isinf -- Looking for isinf - found -- Looking for snprintf -- Looking for snprintf - found -- SWIG_VERSION = 1.3.31 -- Found Perl: /usr/bin/perl -- Looking for pkg-config - found -- Looking for XOpenDisplay in /usr/X11R6/lib/libX11.dylib;/usr/X11R6/lib/libXext.dylib -- Looking for XOpenDisplay in /usr/X11R6/lib/libX11.dylib;/usr/X11R6/lib/libXext.dylib - found -- Looking for gethostbyname -- Looking for gethostbyname - found -- Looking for connect -- Looking for connect - found -- Looking for remove -- Looking for remove - found -- Looking for shmat -- Looking for shmat - found -- Looking for IceConnectionNumber in ICE -- Looking for IceConnectionNumber in ICE - found -- Found X11: /usr/X11R6/lib/libX11.dylib -- X11_FOUND = 1 -- X11_INCLUDE_DIR = /usr/include -- X11_COMPILE_FLAGS = -I/usr/include -- X11_LIBRARIES = /usr/X11R6/lib/libSM.dylib;/usr/X11R6/lib/libICE.dylib;/usr/X11R6/lib/libX11.dylib;/usr/X11R6/lib/libXext.dylib -- CMAKE_GENERATOR = Unix Makefiles -- The CXX compiler identification is GNU -- Check for working CXX compiler: /usr/bin/c++ -- Check for working CXX compiler: /usr/bin/c++ -- works -- Detecting CXX compiler ABI info -- Detecting CXX compiler ABI info - done -- Configuring done -- Generating done -- Build files have been written to: /Users/dsp/fortran_code_development/plplot_install_dir/language_tests/CXX -- The CXX compiler identification is GNU -- Check for working CXX compiler: /usr/bin/c++ -- Check for working CXX compiler: /usr/bin/c++ -- works -- Detecting CXX compiler ABI info -- Detecting CXX compiler ABI info - done -- Check for using namespace support -- Check for using namespace - found -- Looking for C++ include cmath -- Looking for C++ include cmath - found -- Check for broken isnan support in -- Check for isnan in - found -- Check for using stdint.h with CXX compiler -- Check for using stdint.h with CXX compiler - ok -- CMAKE_GENERATOR = Unix Makefiles -- The Fortran compiler identification is Intel -- Check for working Fortran compiler: /opt/intel/Compiler/11.1/067/bin/ia32/ifort -- Check for working Fortran compiler: /opt/intel/Compiler/11.1/067/bin/ia32/ifort -- works -- Checking whether /opt/intel/Compiler/11.1/067/bin/ia32/ifort supports Fortran 90 -- Checking whether /opt/intel/Compiler/11.1/067/bin/ia32/ifort supports Fortran 90 -- yes -- Configuring done -- Generating done -- Build files have been written to: /Users/dsp/fortran_code_development/plplot_install_dir/language_tests/Fortran -- The Fortran compiler identification is Intel -- Check for working Fortran compiler: /opt/intel/Compiler/11.1/067/bin/ia32/ifort -- Check for working Fortran compiler: /opt/intel/Compiler/11.1/067/bin/ia32/ifort -- works -- Checking whether /opt/intel/Compiler/11.1/067/bin/ia32/ifort supports Fortran 90 -- Checking whether /opt/intel/Compiler/11.1/067/bin/ia32/ifort supports Fortran 90 -- yes -- Check for f77 command line support -- Check for f77 command line support - found -- Check if isnan function is available in fortran -- Check for isnan in fortran - found -- NOTICE: Found: /opt/intel/Compiler/11.1/067/bin/ia32/ifort -- NOTICE: Found Intel Visual Fortran -- CMAKE_GENERATOR = Unix Makefiles -- Configuring done -- Generating done -- Build files have been written to: /Users/dsp/fortran_code_development/plplot_install_dir/language_tests/Java -- Found PythonInterp: /sw/bin/python2.6 -- Found PythonLibs: /usr/lib/python2.6/config/libpython2.6.a Traceback (most recent call last): File "", line 1, in ImportError: No module named numpy -- WARNING: Numeric header not found. Disabling python bindings -- OCTAVE = /sw/bin/octave -- MKOCTFILE = /sw/bin/mkoctfile -- OCTAVE_VERSION = 2.1.72 -- WARNING: plplot require octave version 2.9 or greater. Disabling octave bindings -- Looking for include paths and libraries for Tcl/Tk -- Looking for include paths and libraries for Tcl/Tk - found -- Looking for tclsh -- Looking for tclsh - found -- TCL_TCLSH = /sw/bin/tclsh -- HAVE_TCL_GT_84 = 0 -- TCL_INCLUDE_PATH = /usr/include -- TCL_LIBRARY = /usr/lib/libtcl.dylib -- Itcl not available or not compatible with current Tcl shell -- TK_INCLUDE_PATH = /usr/include;/usr/include -- TK_LIBRARY = /usr/lib/libtk.dylib;/usr/X11R6/lib/libSM.dylib;/usr/X11R6/lib/libICE.dylib;/usr/X11R6/lib/libX11.dylib;/usr/X11R6/lib/libXext.dylib -- Looking for itk.h -- Looking for itk.h - not found -- WARNING: Disabling incr Tk interface code -- WARNING: perl PDL module not found. Disabling Perl/PDL examples -- CMAKE_GENERATOR = Unix Makefiles -- Check for working Ada builder: GNAT_EXECUTABLE_BUILDER-NOTFOUND -- Check for working Ada builder: GNAT_EXECUTABLE_BUILDER-NOTFOUND -- broken CMake Error at /Users/dsp/fortran_code_development/plplot-5.9.5/cmake/modules/CMakeTestAdaCompiler.cmake:48 (MESSAGE): The Ada builder "GNAT_EXECUTABLE_BUILDER-NOTFOUND" is not able to compile, bind, and link a simple test program. It fails with the following output: Change Dir: /Users/dsp/fortran_code_development/plplot_install_dir/language_tests/Ada/CMakeFiles/CMakeTmp Run Build Command:/sw/bin/make /sw/bin/cmake -H/Users/dsp/fortran_code_development/plplot_install_dir/language_tests/Ada/CMakeFiles/CMakeTmp -B/Users/dsp/fortran_code_development/plplot_install_dir/language_tests/Ada/CMakeFiles/CMakeTmp --check-build-system CMakeFiles/Makefile.cmake 0 /sw/bin/cmake -E cmake_progress_start /Users/dsp/fortran_code_development/plplot_install_dir/language_tests/Ada/CMakeFiles/CMakeTmp/CMakeFiles /Users/dsp/fortran_code_development/plplot_install_dir/language_tests/Ada/CMakeFiles/CMakeTmp/CMakeFiles/progress.make /sw/bin/make -f CMakeFiles/Makefile2 all /sw/bin/make -f CMakeFiles/testadacompiler.dir/build.make CMakeFiles/testadacompiler.dir/depend cd /Users/dsp/fortran_code_development/plplot_install_dir/language_tests/Ada/CMakeFiles/CMakeTmp && /sw/bin/cmake -E cmake_depends "Unix Makefiles" /Users/dsp/fortran_code_development/plplot_install_dir/language_tests/Ada/CMakeFiles/CMakeTmp /Users/dsp/fortran_code_development/plplot_install_dir/language_tests/Ada/CMakeFiles/CMakeTmp /Users/dsp/fortran_code_development/plplot_install_dir/language_tests/Ada/CMakeFiles/CMakeTmp /Users/dsp/fortran_code_development/plplot_install_dir/language_tests/Ada/CMakeFiles/CMakeTmp /Users/dsp/fortran_code_development/plplot_install_dir/language_tests/Ada/CMakeFiles/CMakeTmp/CMakeFiles/testadacompiler.dir/DependInfo.cmake --color= Scanning dependencies of target testadacompiler /sw/bin/make -f CMakeFiles/testadacompiler.dir/build.make CMakeFiles/testadacompiler.dir/build /sw/bin/cmake -E cmake_progress_report /Users/dsp/fortran_code_development/plplot_install_dir/language_tests/Ada/CMakeFiles/CMakeTmp/CMakeFiles 1 [100%] Building Ada object CMakeFiles/testadacompiler.dir/testadacompiler.o /usr/bin/gcc -c /Users/dsp/fortran_code_development/plplot_install_dir/language_tests/Ada/CMakeFiles/CMakeTmp/testadacompiler.adb -o CMakeFiles/testadacompiler.dir/testadacompiler.o i686-apple-darwin10-gcc-4.2.1: /Users/dsp/fortran_code_development/plplot_install_dir/language_tests/Ada/CMakeFiles/CMakeTmp/testadacompiler.adb: Ada compiler not installed on this system make[2]: *** [CMakeFiles/testadacompiler.dir/testadacompiler.o] Error 1 make[1]: *** [CMakeFiles/testadacompiler.dir/all] Error 2 make: *** [all] Error 2 CMake will not be able to correctly generate this project. Call Stack (most recent call first): CMakeLists.txt:7 (enable_language) -- Configuring incomplete, errors occurred! -- WARNING: no working Ada compiler so disabling Ada bindings and examples. -- OCAMLBUILD = /sw/bin/ocamlbuild -- WARNING:ocamlfind not found. Disabling ocaml bindings -- WARNING: swig version too old for Lua bindings. Disabling Lua bindings. -- CMAKE_GENERATOR = Unix Makefiles -- D Compiler Install Prefix (use D_PATH env var to override): CMAKE_D_COMPILER- CMake Error: your D compiler: "CMAKE_D_COMPILER-NOTFOUND" was not found. Please set CMAKE_D_COMPILER to a valid compiler path or name. -- Configuring incomplete, errors occurred! -- WARNING: no working D compiler so disabling D bindings and examples. -- Check for NaN awareness in C compiler -- Check for NaN awareness in C compiler - found -- FindQHull: Found both qhull_a.h and libqhull.a -- Looking for qh_new_qhull -- Looking for qh_new_qhull - not found -- WARNING: function qh_new_qhull not found. Setting HAVE_QHULL to OFF. -- checking for module 'pango' dyld: Library not loaded: /usr/lib/libutil.dylib Referenced from: /usr/bin/perl5.10.0 Reason: Incompatible library version: perl5.10.0 requires version 1.0.0 or later, but libutil.dylib provides version 0.0.0 -- package 'pango' not found -- WARNING: pkg-config does not find pango. -- checking for module 'pangoft2' dyld: Library not loaded: /usr/lib/libutil.dylib Referenced from: /usr/bin/perl5.10.0 Reason: Incompatible library version: perl5.10.0 requires version 1.0.0 or later, but libutil.dylib provides version 0.0.0 -- package 'pangoft2' not found -- WARNING: pkg-config does not find pangoft2. -- Looking for dlopen in dl -- Looking for dlopen in dl - found -- Found LTDL: /usr/lib/libltdl.dylib;/usr/lib/libdl.dylib -- LTDL_INCLUDE_DIR = /usr/include -- LTDL_LIBRARY_DIR = /usr/lib -- LTDL_LIBRARIES = /usr/lib/libltdl.dylib;/usr/lib/libdl.dylib -- checking for module 'pangocairo' dyld: Library not loaded: /usr/lib/libutil.dylib Referenced from: /usr/bin/perl5.10.0 Reason: Incompatible library version: perl5.10.0 requires version 1.0.0 or later, but libutil.dylib provides version 0.0.0 -- package 'pangocairo' not found includedir = libdir = linkflags = cflags = -- WARNING: pango and/or cairo not found with pkg-config. Disabling cairo drivers. To enable these drivers you must install development versions of pango and cairo and/or set the environment variable PKG_CONFIG_PATH appropriately. -- checking for modules 'lasi;pango;pangoft2' dyld: Library not loaded: /usr/lib/libutil.dylib Referenced from: /usr/bin/perl5.10.0 Reason: Incompatible library version: perl5.10.0 requires version 1.0.0 or later, but libutil.dylib provides version 0.0.0 -- package 'lasi' not found dyld: Library not loaded: /usr/lib/libutil.dylib Referenced from: /usr/bin/perl5.10.0 Reason: Incompatible library version: perl5.10.0 requires version 1.0.0 or later, but libutil.dylib provides version 0.0.0 -- package 'pango' not found dyld: Library not loaded: /usr/lib/libutil.dylib Referenced from: /usr/bin/perl5.10.0 Reason: Incompatible library version: perl5.10.0 requires version 1.0.0 or later, but libutil.dylib provides version 0.0.0 -- package 'pangoft2' not found includedir = libdir = linkflags = cflags = -- WARNING: pango, pangoft2, or lasi not found with pkg-config. Setting PLD_psttf to OFF. Please install all of these packages and/or set the environment variable PKG_CONFIG_PATH appropriately. -- WARNING: Qt4 development environment not found so disabling all qt devices. -- WARNING: PLD_extqt is OFF so setting ENABLE_qt to OFF. -- WARNING: ENABLE_python is OFF so setting ENABLE_pyqt4 to OFF. -- Found AQT: /usr/local/include/AquaTerm/AQTAdapter.h -- wxWidgets found -- wxwidgets_COMPILE_FLAGS = -I/usr/lib/wx/include/mac-unicode-debug-2.8 -I/usr/include/wx-2.8 -D_FILE_OFFSET_BITS=64 -D_LARGE_FILES -D__WXDEBUG__ -D__WXMAC__ -- wxwidgets_LINK_FLAGS = -framework IOKit;-framework Carbon;-framework Cocoa;-framework System;-framework QuickTime;-framework OpenGL;-framework AGL;/usr/lib/libwx_macud-2.8.dylib -- checking for module 'libagg' dyld: Library not loaded: /usr/lib/libutil.dylib Referenced from: /usr/bin/perl5.10.0 Reason: Incompatible library version: perl5.10.0 requires version 1.0.0 or later, but libutil.dylib provides version 0.0.0 -- package 'libagg' not found -- Could NOT find AGG (missing: AGG_LIBRARIES AGG_INCLUDE_DIR) -- WARNING: AGG not found. Setting HAVE_AGG to OFF. -- validate target will be available to check for syntax errors in the PLplot DocBook documentation using /sw/bin/onsgmls. Summary of CMake build system results for PLplot Install location variables which can be set by the user: CMAKE_INSTALL_PREFIX: /usr/local/plplot CMAKE_INSTALL_EXEC_PREFIX /usr/local/plplot CMAKE_INSTALL_BINDIR /usr/local/plplot/bin CMAKE_INSTALL_DATADIR /usr/local/plplot/share CMAKE_INSTALL_LIBDIR /usr/local/plplot/lib CMAKE_INSTALL_INCLUDEDIR /usr/local/plplot/include CMAKE_INSTALL_INFODIR /usr/local/plplot/share/info CMAKE_INSTALL_MANDIR /usr/local/plplot/share/man Derived install location variables: DATA_DIR /usr/local/plplot/share/plplot5.9.5 LIB_DIR /usr/local/plplot/lib INCLUDE_DIR /usr/local/plplot/include/plplot BIN_DIR /usr/local/plplot/bin TCL_DIR /usr/local/plplot/share/plplot5.9.5/tcl ADA_INCLUDE_DIR /usr/local/plplot/share/ada/adainclude/plplotadad ADA_LIB_DIR /usr/local/plplot/lib/ada/adalib/plplotadad PYTHON_INSTDIR DRV_DIR /usr/local/plplot/lib/plplot5.9.5/driversd DOC_DIR /usr/local/plplot/share/doc/plplot MAN_DIR /usr/local/plplot/share/man INFO_DIR /usr/local/plplot/share/info Other important CMake variables: CMAKE_SYSTEM_NAME: Darwin UNIX: 1 WIN32: APPLE: 1 MSVC: (MSVC_VERSION: ) MINGW: MSYS: CYGWIN: BORLAND: WATCOM: SWIG_FOUND: 1 PERL_FOUND: TRUE X11_FOUND: 1 CMAKE_BUILD_TYPE: CMAKE_C_COMPILER CMAKE_C_FLAGS: /usr/bin/gcc CMAKE_CXX_COMPILER CMAKE_CXX_FLAGS: /usr/bin/c++ CMAKE_Fortran_COMPILER CMAKE_Fortran_FLAGS: /opt/intel/Compiler/11.1/067/bin/ia32/ifort Target Fortran: IVF LIB_TAG: d ENABLE_DYNDRIVERS: ON DRIVERS_LIST: aqt;mem;null;ps;svg;tk;tkwin;wxwidgets;xfig;xwin DEVICES_LIST: aqt;mem;null;ps;svg;tk;tkwin;wxwidgets;xfig;xwin Library options: BUILD_SHARED_LIBS: ON PL_DOUBLE: ON Optional libraries: HAVE_QHULL: OFF WITH_CSA: ON HAVE_FREETYPE: HAVE_PTHREAD: OFF HAVE_AGG: OFF Language Bindings: ENABLE_f77: ON ENABLE_f95: ON ENABLE_cxx: ON ENABLE_java: ON ENABLE_python: OFF ENABLE_octave: OFF ENABLE_tcl: ON ENABLE_itcl: OFF ENABLE_tk: ON ENABLE_itk: OFF ENABLE_pdl: OFF ENABLE_wxwidgets: ON ENABLE_gnome2: OFF ENABLE_pygcw: OFF ENABLE_ada: OFF ENABLE_d: OFF ENABLE_ocaml: OFF ENABLE_lua: OFF ENABLE_qt: OFF ENABLE_pyqt4: OFF -- Configuring done -- Generating done -- Build files have been written to: /Users/dsp/fortran_code_development/plplot_install_dir --Boundary_(ID_ryHHj5p0PoQ2tORnQum00g) Content-type: text/html; charset=us-ascii Content-transfer-encoding: 7bit --Boundary_(ID_ryHHj5p0PoQ2tORnQum00g) Content-type: application/octet-stream; name="make.out" Content-transfer-encoding: 7bit Content-disposition: attachment; filename=make.out Scanning dependencies of target csirocsa [ 0%] Building C object lib/csa/CMakeFiles/csirocsa.dir/csa.c.o Linking C shared library libcsirocsa.dylib [ 0%] Built target csirocsa Scanning dependencies of target deltaT-gen [ 0%] Building C object lib/qsastime/CMakeFiles/deltaT-gen.dir/deltaT-gen.c.o [ 0%] Building C object lib/qsastime/CMakeFiles/deltaT-gen.dir/dspline.c.o Linking C executable deltaT-gen [ 0%] Built target deltaT-gen Scanning dependencies of target deltaT.h_built [ 0%] Generating deltaT.h [ 0%] Built target deltaT.h_built Scanning dependencies of target tai-utc-gen [ 0%] Building C object lib/qsastime/CMakeFiles/tai-utc-gen.dir/tai-utc-gen.c.o Linking C executable tai-utc-gen [ 0%] Built target tai-utc-gen Scanning dependencies of target tai-utc.h_built [ 0%] Generating tai-utc.h [ 0%] Built target tai-utc.h_built Scanning dependencies of target qsastime [ 1%] Building C object lib/qsastime/CMakeFiles/qsastime.dir/qsastime.c.o [ 1%] Building C object lib/qsastime/CMakeFiles/qsastime.dir/dsplint.c.o Linking C shared library libqsastime.dylib [ 1%] Built target qsastime Scanning dependencies of target plhershey-unicode-gen [ 1%] Building C object include/CMakeFiles/plhershey-unicode-gen.dir/__/fonts/plhershey-unicode-gen.c.o Linking C executable plhershey-unicode-gen [ 1%] Built target plhershey-unicode-gen Scanning dependencies of target plhershey-unicode.h_built [ 1%] Generating plhershey-unicode.h [ 2%] Built target plhershey-unicode.h_built Scanning dependencies of target plplotd [ 2%] Building C object src/CMakeFiles/plplotd.dir/pdfutils.c.o [ 2%] Building C object src/CMakeFiles/plplotd.dir/plarc.c.o [ 2%] Building C object src/CMakeFiles/plplotd.dir/plargs.c.o [ 2%] Building C object src/CMakeFiles/plplotd.dir/plbox.c.o [ 3%] Building C object src/CMakeFiles/plplotd.dir/plcont.c.o [ 3%] Building C object src/CMakeFiles/plplotd.dir/plcore.c.o [ 3%] Building C object src/CMakeFiles/plplotd.dir/plctrl.c.o [ 3%] Building C object src/CMakeFiles/plplotd.dir/plcvt.c.o [ 3%] Building C object src/CMakeFiles/plplotd.dir/pldeprecated.c.o [ 4%] Building C object src/CMakeFiles/plplotd.dir/pldtik.c.o [ 4%] Building C object src/CMakeFiles/plplotd.dir/plfill.c.o [ 4%] Building C object src/CMakeFiles/plplotd.dir/plfreetype.c.o [ 4%] Building C object src/CMakeFiles/plplotd.dir/plhist.c.o [ 4%] Building C object src/CMakeFiles/plplotd.dir/plimage.c.o [ 5%] Building C object src/CMakeFiles/plplotd.dir/plline.c.o [ 5%] Building C object src/CMakeFiles/plplotd.dir/plmap.c.o [ 5%] Building C object src/CMakeFiles/plplotd.dir/plot3d.c.o [ 5%] Building C object src/CMakeFiles/plplotd.dir/plpage.c.o [ 5%] Building C object src/CMakeFiles/plplotd.dir/plsdef.c.o [ 6%] Building C object src/CMakeFiles/plplotd.dir/plshade.c.o [ 6%] Building C object src/CMakeFiles/plplotd.dir/plstdio.c.o [ 6%] Building C object src/CMakeFiles/plplotd.dir/plstripc.c.o [ 6%] Building C object src/CMakeFiles/plplotd.dir/plsym.c.o [ 6%] Building C object src/CMakeFiles/plplotd.dir/pltick.c.o [ 7%] Building C object src/CMakeFiles/plplotd.dir/plvpor.c.o [ 7%] Building C object src/CMakeFiles/plplotd.dir/plwind.c.o [ 7%] Building C object src/CMakeFiles/plplotd.dir/plbuf.c.o [ 7%] Building C object src/CMakeFiles/plplotd.dir/plgridd.c.o [ 8%] Building C object src/CMakeFiles/plplotd.dir/plvect.c.o [ 8%] Building C object src/CMakeFiles/plplotd.dir/mt19937ar.c.o [ 8%] Building C object src/CMakeFiles/plplotd.dir/pltime.c.o Linking C shared library libplplotd.dylib ld: warning: duplicate dylib /usr/lib/libm.dylib [ 8%] Built target plplotd Scanning dependencies of target pkgIndex.tcl [ 8%] Built target pkgIndex.tcl Scanning dependencies of target plplotcxxd [ 8%] Building CXX object bindings/c++/CMakeFiles/plplotcxxd.dir/plstream.cc.o Linking CXX shared library libplplotcxxd.dylib [ 8%] Built target plplotcxxd Scanning dependencies of target plplotf77cd [ 8%] Building C object bindings/f77/CMakeFiles/plplotf77cd.dir/sc3d.c.o [ 9%] Building C object bindings/f77/CMakeFiles/plplotf77cd.dir/sccont.c.o [ 9%] Building C object bindings/f77/CMakeFiles/plplotf77cd.dir/scstubs.c.o Linking C shared library libplplotf77cd.dylib [ 9%] Built target plplotf77cd [ 10%] Generating sfstubs.f Scanning dependencies of target plplotf77d [ 10%] Building Fortran object bindings/f77/CMakeFiles/plplotf77d.dir/strutil.f.o [ 10%] Building Fortran object bindings/f77/CMakeFiles/plplotf77d.dir/sfstubs.f.o [ 10%] Building Fortran object bindings/f77/CMakeFiles/plplotf77d.dir/configurable.f.o Linking Fortran shared library libplplotf77d.dylib ipo: warning #11009: file format not recognized for libplplotf77cd.9.1.1.dylib ipo: warning #11009: file format not recognized for ../../src/libplplotd.9.7.0.dylib ipo: warning #11009: file format not recognized for ../../lib/csa/libcsirocsa.0.0.1.dylib ipo: warning #11009: file format not recognized for ../../lib/qsastime/libqsastime.0.0.1.dylib ld: warning: in libplplotf77cd.9.1.1.dylib, file is not of required architecture ld: warning: in ../../src/libplplotd.9.7.0.dylib, file is not of required architecture ld: warning: in ../../lib/csa/libcsirocsa.0.0.1.dylib, file is not of required architecture ld: warning: in ../../lib/qsastime/libqsastime.0.0.1.dylib, file is not of required architecture Undefined symbols: "_plgdev7_", referenced from: _plgdev_ in sfstubs.f.o "_plcont7_", referenced from: _plcont_ in sfstubs.f.o "_plparseopts7_", referenced from: _plparseopts_ in configurable.f.o "_plshade07_", referenced from: _plshade0_ in sfstubs.f.o "_plimagefr07_", referenced from: _plimagefr0_ in sfstubs.f.o "_plshade17_", referenced from: _plshade1_ in sfstubs.f.o "_plimagefr17_", referenced from: _plimagefr1_ in sfstubs.f.o "_plmeridians7_", referenced from: _plmeridians_ in sfstubs.f.o "_plshade27_", referenced from: _plshade2_ in sfstubs.f.o "_plimagefr27_", referenced from: _plimagefr2_ in sfstubs.f.o "_pltimefmt7_", referenced from: _pltimefmt_ in sfstubs.f.o "_plshades7_", referenced from: _plshades_ in sfstubs.f.o "_plmtex37_", referenced from: _plmtex3_ in sfstubs.f.o "_plgver7_", referenced from: _plgver_ in sfstubs.f.o "_plspal07_", referenced from: _plspal0_ in sfstubs.f.o "_plshade7_", referenced from: _plshade_ in sfstubs.f.o "_plspal17_", referenced from: _plspal1_ in sfstubs.f.o "_plsdev7_", referenced from: _plsdev_ in sfstubs.f.o "_pllab7_", referenced from: _pllab_ in sfstubs.f.o "_plsfnam7_", referenced from: _plsfnam_ in sfstubs.f.o "_plimagefr7_", referenced from: _plimagefr_ in sfstubs.f.o "_plvec07_", referenced from: _plvec0_ in sfstubs.f.o "_plvec17_", referenced from: _plvec1_ in sfstubs.f.o "_plvec27_", referenced from: _plvec2_ in sfstubs.f.o "_plvect7_", referenced from: _plvect_ in sfstubs.f.o "_plptex37_", referenced from: _plptex3_ in sfstubs.f.o "_plsetopt7_", referenced from: _plsetopt_ in sfstubs.f.o "_plmtex7_", referenced from: _plmtex_ in sfstubs.f.o "_plptex7_", referenced from: _plptex_ in sfstubs.f.o "_plbox7_", referenced from: _plbox_ in sfstubs.f.o "_plbox37_", referenced from: _plbox3_ in sfstubs.f.o "_plstripc7_", referenced from: _plstripc_ in sfstubs.f.o "_plshades07_", referenced from: _plshades0_ in sfstubs.f.o "_plshades17_", referenced from: _plshades1_ in sfstubs.f.o "_plshades27_", referenced from: _plshades2_ in sfstubs.f.o "_plgfnam7_", referenced from: _plgfnam_ in sfstubs.f.o "_plabort7_", referenced from: _plabort_ in sfstubs.f.o "_plsetmapformc_", referenced from: _plmap_ in sfstubs.f.o _plmeridians_ in sfstubs.f.o "_plaxes7_", referenced from: _plaxes_ in sfstubs.f.o "_plstart7_", referenced from: _plstart_ in sfstubs.f.o "_plcon07_", referenced from: _plcon0_ in sfstubs.f.o "_plcon17_", referenced from: _plcon1_ in sfstubs.f.o "_plmap7_", referenced from: _plmap_ in sfstubs.f.o "_plcon27_", referenced from: _plcon2_ in sfstubs.f.o ld: symbol(s) not found make[2]: *** [bindings/f77/libplplotf77d.9.1.1.dylib] Error 1 make[1]: *** [bindings/f77/CMakeFiles/plplotf77d.dir/all] Error 2 make: *** [all] Error 2 --Boundary_(ID_ryHHj5p0PoQ2tORnQum00g) Content-type: text/html; charset=us-ascii Content-transfer-encoding: 7bit --Boundary_(ID_ryHHj5p0PoQ2tORnQum00g) Content-type: application/octet-stream; name="make_install.out" Content-transfer-encoding: 7bit Content-disposition: attachment; filename=make_install.out [ 0%] Built target csirocsa [ 0%] Built target deltaT-gen [ 0%] Built target deltaT.h_built [ 0%] Built target tai-utc-gen [ 0%] Built target tai-utc.h_built [ 1%] Built target qsastime [ 1%] Built target plhershey-unicode-gen [ 2%] Built target plhershey-unicode.h_built [ 8%] Built target plplotd [ 8%] Built target pkgIndex.tcl [ 8%] Built target plplotcxxd [ 9%] Built target plplotf77cd Linking Fortran shared library libplplotf77d.dylib ipo: warning #11009: file format not recognized for libplplotf77cd.9.1.1.dylib ipo: warning #11009: file format not recognized for ../../src/libplplotd.9.7.0.dylib ipo: warning #11009: file format not recognized for ../../lib/csa/libcsirocsa.0.0.1.dylib ipo: warning #11009: file format not recognized for ../../lib/qsastime/libqsastime.0.0.1.dylib ld: warning: in libplplotf77cd.9.1.1.dylib, file is not of required architecture ld: warning: in ../../src/libplplotd.9.7.0.dylib, file is not of required architecture ld: warning: in ../../lib/csa/libcsirocsa.0.0.1.dylib, file is not of required architecture ld: warning: in ../../lib/qsastime/libqsastime.0.0.1.dylib, file is not of required architecture Undefined symbols: "_plgdev7_", referenced from: _plgdev_ in sfstubs.f.o "_plcont7_", referenced from: _plcont_ in sfstubs.f.o "_plparseopts7_", referenced from: _plparseopts_ in configurable.f.o "_plshade07_", referenced from: _plshade0_ in sfstubs.f.o "_plimagefr07_", referenced from: _plimagefr0_ in sfstubs.f.o "_plshade17_", referenced from: _plshade1_ in sfstubs.f.o "_plimagefr17_", referenced from: _plimagefr1_ in sfstubs.f.o "_plmeridians7_", referenced from: _plmeridians_ in sfstubs.f.o "_plshade27_", referenced from: _plshade2_ in sfstubs.f.o "_plimagefr27_", referenced from: _plimagefr2_ in sfstubs.f.o "_pltimefmt7_", referenced from: _pltimefmt_ in sfstubs.f.o "_plshades7_", referenced from: _plshades_ in sfstubs.f.o "_plmtex37_", referenced from: _plmtex3_ in sfstubs.f.o "_plgver7_", referenced from: _plgver_ in sfstubs.f.o "_plspal07_", referenced from: _plspal0_ in sfstubs.f.o "_plshade7_", referenced from: _plshade_ in sfstubs.f.o "_plspal17_", referenced from: _plspal1_ in sfstubs.f.o "_plsdev7_", referenced from: _plsdev_ in sfstubs.f.o "_pllab7_", referenced from: _pllab_ in sfstubs.f.o "_plsfnam7_", referenced from: _plsfnam_ in sfstubs.f.o "_plimagefr7_", referenced from: _plimagefr_ in sfstubs.f.o "_plvec07_", referenced from: _plvec0_ in sfstubs.f.o "_plvec17_", referenced from: _plvec1_ in sfstubs.f.o "_plvec27_", referenced from: _plvec2_ in sfstubs.f.o "_plvect7_", referenced from: _plvect_ in sfstubs.f.o "_plptex37_", referenced from: _plptex3_ in sfstubs.f.o "_plsetopt7_", referenced from: _plsetopt_ in sfstubs.f.o "_plmtex7_", referenced from: _plmtex_ in sfstubs.f.o "_plptex7_", referenced from: _plptex_ in sfstubs.f.o "_plbox7_", referenced from: _plbox_ in sfstubs.f.o "_plbox37_", referenced from: _plbox3_ in sfstubs.f.o "_plstripc7_", referenced from: _plstripc_ in sfstubs.f.o "_plshades07_", referenced from: _plshades0_ in sfstubs.f.o "_plshades17_", referenced from: _plshades1_ in sfstubs.f.o "_plshades27_", referenced from: _plshades2_ in sfstubs.f.o "_plgfnam7_", referenced from: _plgfnam_ in sfstubs.f.o "_plabort7_", referenced from: _plabort_ in sfstubs.f.o "_plsetmapformc_", referenced from: _plmap_ in sfstubs.f.o _plmeridians_ in sfstubs.f.o "_plaxes7_", referenced from: _plaxes_ in sfstubs.f.o "_plstart7_", referenced from: _plstart_ in sfstubs.f.o "_plcon07_", referenced from: _plcon0_ in sfstubs.f.o "_plcon17_", referenced from: _plcon1_ in sfstubs.f.o "_plmap7_", referenced from: _plmap_ in sfstubs.f.o "_plcon27_", referenced from: _plcon2_ in sfstubs.f.o ld: symbol(s) not found make[2]: *** [bindings/f77/libplplotf77d.9.1.1.dylib] Error 1 make[1]: *** [bindings/f77/CMakeFiles/plplotf77d.dir/all] Error 2 make: *** [all] Error 2 --Boundary_(ID_ryHHj5p0PoQ2tORnQum00g) Content-type: text/html; charset=us-ascii Content-transfer-encoding: quoted-printable
On = 2009-11-10 13:38-0500 Don Spong wrote:

Hi,

I recently = upgraded from Mac OSX 10.5 to 10.6.2 (Snow Leopard). I've = been
successfully using a = Plplot installation that I got through Fink = (version
5.6.1). I use this = with the Intel ifort Fortran compiler by
including `plplot-config --cflags --libs --with-f77` = on the load line.
However, the = 10.6.2 upgrade seems to have broken things for Plplot = (see
below). I can still run = codes using Plplot that were built before = the
upgrade, but cannot build = new versions. Any suggestions as to how to = fix
this?

Hi= Don:

If Werner's suggestion for dealing with the immediate issue = doesn't work,
then I suggest you upgrade to a more modern version of = PLplot. (The 5.6.1
version of PLplot that you are trying to use came = out more than 3 (!) years
ago).  Even the latest fink version = (5.8.0) is outdated so I suggest you use
the latest PLplot release = (5.9.5) following the build directions at
http://www.miscdebris.net/plplot_wiki/index.php?title=3DBuilding_PL= plot.
PLplot-5.9.5 has lots of great features (e.g., good-looking = fonts and new
powerful device drivers) compared to 5.6.1 and also = should be more reliable
than 5.6.1 because we now do a more careful = job of testing before releases.

Note, CMake (version 2.6.0 or = later) is now a prerequiste for our build
system, but that is easy to = obtain.  Also, we have dropped plplot-config
altogether in = favour of either (1) a pkg-config method of obtaining the
flags you = need to build applications that use the PLplot library or (2) a
new = experimental CMake-based method for building applications that use = the
PLplot library.  Both methods are illustrated in the = installed examples
directory.

If you have any trouble = following the Mac OS X build instructions in the
Wiki for = PLplot-5.9.5 or building your own applications using the = 5.9.5
version of the PLplot library, let us know here, and we can = give you a hand.

Alan
__________________________
Alan W. = Irwin

Astronomical research affiliation with Department of = Physics and Astronomy,
University of Victoria (astrowww.phys.uvic.ca).

P= rogramming affiliations with the FreeEOS equation-of-state = implementation
for stellar interiors (freeeos.sf.net); PLplot scientific = plotting software
package (plplot.org); the libLASi project (unifont.org/lasi); the Loads = of
Linux Links project (loll.sf.net); and the Linux Brochure = Project
(lbproject.sf.net).
_______________= ___________

Linux-powered = Science
__________________________

Donald A. Spong, Fusion = Energy Theory, ORNL
One Bethel Valley Road, Bldg. = 5700
Oak Ridge, = Tennessee  37831-6169
Phone: (865) 574-1304   FAX: = (865) 576-7926               =     E-mail: spongda@ornl.gov

= --Boundary_(ID_ryHHj5p0PoQ2tORnQum00g)--