Thanks for the report. The Zoo code is new and experimental, and not tested on all platforms. Hence the alpha release.

Quick work-around:

In the file <stage>/src/, find the section beginning

libstageplugin_la_SOURCES = 

and comment out all lines beginning "zoo_" , in that section, taking care with the line breaks '\'.

and rebuild.


On 17-Nov-05, at 10:02 AM, Hugo Gravato Marques wrote:


I'm trying to install stage-2.0.0a on my MacOSX and I cannot find wordexp.h
... The bad news is that it seems that this file does not exist for MacOSX.
I put the error below.

Any suggestions?


******************************************  Error code

 g++ -DHAVE_CONFIG_H -I. -I. -I.. -Wall -I. -I../replace
-I/usr/local/include -I/sw/include/gtk-2.0 -I/sw/lib/gtk-2.0/include
-I/usr/X11R6/include -I/sw/include/atk-1.0 -I/sw/include/pango-1.0
-I/usr/X11R6/include/freetype2 -I/sw/include/glib-2.0
-I/sw/lib/glib-2.0/include -g -O2 -MT zoo_driver.lo -MD -MP -MF
.deps/zoo_driver.Tpo -c  -fno-common -DPIC -o
.libs/zoo_driver.o wordexp.h: No such file or directory In member function `void ZooController::Run(int)': error: `wordexp_t' undeclared (first use this function) error: (Each undeclared identifier is reported only once
   each function it appears in.) error: parse error before `;' token error: `wex' undeclared (first use this function) error: `wordexp' undeclared (first use this function)
make[2]: *** [zoo_driver.lo] Error 1
make[1]: *** [all-recursive] Error 1
make: *** [all] Error 2

This SF.Net email is sponsored by the JBoss Inc.  Get Certified Today
Register for a JBoss Training Course.  Free Certification Exam
for All Training Attendees Through End of 2005. For more info visit:
Playerstage-users mailing list


Richard Vaughan

School of Computing Science / Simon Fraser University