Hi,
   I am trying to install Player and Stage from the CVS repository to a local folder. Player was installed without any issues. However My stage installation gives the following  errors:
 I did ./configure --with-color=//usr/share/X11/rgb.txt --prefix=/home/swarm/stage
 Then I did a make to get the following errors:
********************************************************************************************************
p_simulation.cc:79: error: 'player_argc' was not declared in this scope
p_simulation.cc:79: error: 'player_argv' was not declared in this scope
make[3]: *** [libstageplugin_la-p_simulation.lo] Error 1
make[3]: Leaving directory `/home/swarm/Documents/stage/libstageplugin'
make[2]: *** [all-recursive] Error 1
make[2]: Leaving directory `/home/swarm/Documents/stage/libstageplugin'
make[1]: *** [all-recursive] Error 1
make[1]: Leaving directory `/home/swarm/Documents/stage'
make: *** [all] Error 2
*****************************************************************************

We did a search for p_simulation.cc in the stage installation folder to get the following files
/home/swarm/Documents/stage/src/p_simulation.cc
/home/swarm/Documents/stage/libstageplugin/p_simulation.cc
 

We checked the file to find that the file in the libstageplugin folder had a reference to globals.h. We found that globals.h was in the player installation directory under /include/player-2.1/libplayercore/globals.h. We edited the p_simulation.cc file to reflect the same as the path for globals.h. However we seem to be getting the same error. Any help  would be highly useful.

Thanks in advance.

Regards
Eshwaran