scientist_rahul - 2007-06-27

Hello Friends,

Sorry that i got the following error while compiling pdftohtml
please see whats the problem.

i was still able to run pdftohtml but the output html does not contain anytext

the output of compiling is attached:

HtmlLinks.h:22: error: extra qualification ‘HtmlLink::’ on member ‘isEqualDest’
make[1]: *** [HtmlOutputDev.o] Error 1
make: *** [all] Error 2