Hi! Thanks for the program!! Could anybody help me with this:

cd kpdf-kde-3.3.2 && /usr/share/qt3/bin/qmake && make staticlib
make[2]: se ingresa al directorio `/home/juan/Desktop/pdfedit-0.2.5/src/kpdf- kde-3.3.2'
g++ -c -pipe -g -Wall -W -O2 -D_REENTRANT  -DQT_NO_DEBUG -DQT_THREAD_SUPPORT -I/usr/share/qt3/mkspecs/linux-g++ -I. -I../xpdf -I../xpdf/xpdf -I../xpdf/goo -I../xpdf/splash -I../xpdf/fofi -I/usr/share/qt3/include -o QOutputDevPixmap.o QOutputDevPixmap.cpp
QOutputDevPixmap.cpp:25:21: error: qpixmap.h: No existe el fichero directorio
QOutputDevPixmap.cpp:26:20: error: qimage.h: No existe el fichero directorio
QOutputDevPixmap.h :40: error: 'QImage' does not name a type
QOutputDevPixmap.h:43: error: 'QImage' does not name a type
QOutputDevPixmap.cpp: In constructor 'QOutputDevPixmap::QOutputDevPixmap(Guchar*)':
QOutputDevPixmap.cpp:39: error: class 'QOutputDevPixmap' does not have any field named 'm_image'
QOutputDevPixmap.cpp: In destructor 'virtual QOutputDevPixmap::~QOutputDevPixmap()':
QOutputDevPixmap.cpp:46: error: 'free' was not declared in this scope
QOutputDevPixmap.cpp: In member function 'virtual void QOutputDevPixmap::endPage()':
QOutputDevPixmap.cpp:60: error: 'free' was not declared in this scope
QOutputDevPixmap.cpp:61: error: 'malloc' was not declared in this scope
QOutputDevPixmap.cpp:62: error: 'm_image' was not declared in this scope
QOutputDevPixmap.cpp:78: error: 'm_image' was not declared in this scope
QOutputDevPixmap.cpp:78: error: 'uchar' was not declared in this scope
QOutputDevPixmap.cpp:78: error: expected primary-expression before ')' token
QOutputDevPixmap.cpp:78: error: 'QImage' has not been declared
QOutputDevPixmap.cpp:78: error: 'QImage' was not declared in this scope
make[2]: *** [QOutputDevPixmap.o] Error 1
make[2]: se sale del directorio `/home/juan/Desktop/pdfedit- 0.2.5/src/kpdf-kde-3.3.2'
make[1]: *** [qoutputdevices] Error 2
make[1]: se sale del directorio `/home/juan/Desktop/pdfedit-0.2.5/src'
make: *** [src] Error 2


Thanks!!!!!