build failed with gcc 3.3.1 and qt 3.2.3
config.status: executing default-1 commands
+ /usr/bin/make
cd . \
&& CONFIG_FILES= CONFIG_HEADERS=config.h \
/bin/sh ./config.status
config.status: creating config.h
config.status: config.h is unchanged
config.status: executing default-1 commands
/usr/bin/make all-recursive
make[1]: Wchodzę do katalogu
`/maho/domy/maho/rpm/BUILD/pcmm-1.0'
Making all in pcmm
make[2]: Wchodzę do katalogu
`/maho/domy/maho/rpm/BUILD/pcmm-1.0/pcmm'
Making all in pconfig
make[3]: Wchodzę do katalogu
`/maho/domy/maho/rpm/BUILD/pcmm-1.0/pcmm/pconfig'
source='advancedconfigimpl.cpp'
object='advancedconfigimpl.o' libtool=no \
depfile='.deps/advancedconfigimpl.Po'
tmpdepfile='.deps/advancedconfigimpl.TPo' \
depmode=gcc3 /bin/sh ../../admin/depcomp \
athlon-pld-linux-g++ -DHAVE_CONFIG_H -I. -I. -I../..
-I/usr/include/qt -I/usr/X11R6/include
-DQT_THREAD_SUPPORT -D_REENTRANT -Wnon-virtual-dtor
-Wno-long-long -Wbad-function-cast -Wundef -Wall
-pedantic -W -Wpointer-arith -Wmissing-prototypes
-Wwrite-strings -ansi -D_XOPEN_SOURCE=500 -D_BSD_SOURCE
-Wcast-align -Wconversion -DNDEBUG -DNO_DEBUG -O2 -O2
-march=athlon -fno-exceptions -fno-check-new -c -o
advancedconfigimpl.o `test -f advancedconfigimpl.cpp ||
echo './'`advancedconfigimpl.cpp
cc1plus: warning: "-Wbad-function-cast" is valid for
C/ObjC but not for C++
In file included from ../pfileview.h:32,
from ../pfilepanel.h:30,
from ../pdoublefilepanel.h:23,
from ../pcmm.h:32,
from advancedconfigimpl.cpp:23:
../plistview.h:32: error: friend declaration requires
class-key, i.e. `friend
struct PListViewItem'
In file included from ../pfilepanel.h:30,
from ../pdoublefilepanel.h:23,
from ../pcmm.h:32,
from advancedconfigimpl.cpp:23:
../pfileview.h:113: error: friend declaration requires
class-key, i.e. `friend
class PFileManager'
../pfileview.h:114: error: friend declaration requires
class-key, i.e. `friend
class PFileViewCache'
../pfileview.h:115: error: friend declaration requires
class-key, i.e. `friend
class PFileViewItem'
In file included from ../pdoublefilepanel.h:23,
from ../pcmm.h:32,
from advancedconfigimpl.cpp:23:
../pfilepanel.h:47: error: friend declaration requires
class-key, i.e. `friend
class PFileView'
make[3]: *** [advancedconfigimpl.o] Błąd 1
make[3]: Opuszczam katalog
`/maho/domy/maho/rpm/BUILD/pcmm-1.0/pcmm/pconfig'
make[2]: *** [all-recursive] Błąd 1
make[2]: Opuszczam katalog
`/maho/domy/maho/rpm/BUILD/pcmm-1.0/pcmm'
make[1]: *** [all-recursive] Błąd 1
make[1]: Opuszczam katalog
`/maho/domy/maho/rpm/BUILD/pcmm-1.0'
make: *** [all] Błąd 2
błąd: Błędny status wyjścia z /var/tmp/rpm-tmp.7184
(%build)