Hi All,

I'm in the process of trying to do a make, but get the following error message;

nle.cxx: In constructor ‘ExportDialog::ExportDialog()’:
nle.cxx:6799: error: ‘lqt_find_video_codec’ was not declared in this scope
nle.cxx:6802: error: ‘lqt_find_audio_codec’ was not declared in this scope
nle.cxx: In member function ‘nle::IVideoFileWriter* ExportDialog::getFileWriter()’:
nle.cxx:6955: error: ‘LQT_FILE_AVI_ODML’ was not declared in this scope
nle.cxx:6955: error: ‘lqt_open_write’ was not declared in this scope
nle.cxx:6957: error: ‘LQT_FILE_QT’ was not declared in this scope
nle.cxx:6957: error: ‘lqt_open_write’ was not declared in this scope
make[3]: *** [nle.o] Error 1
make[3]: Leaving directory `/home/i/Desktop/openmovieeditor-0.0.20070911/src'
make[2]: *** [all-recursive] Error 1
make[2]: Leaving directory `/home/i/Desktop/openmovieeditor-0.0.20070911/src'
make[1]: *** [all-recursive] Error 1
make[1]: Leaving directory `/home/i/Desktop/openmovieeditor-0.0.20070911'
make: *** [all] Error 2


The error message is not making any sense to me and googleing has not returned any meaningful results. I would appreciate any help anyone can offer.

Thanks,
Ishaqx


Yahoo! Answers - Get better answers from someone who knows. Try it now.