Can't make on Fedora 9

Help
2008-10-01
2012-10-06
  • Chilliwack0

    Chilliwack0 - 2008-10-01

    Mornin' folks.
    I got Fedora 9, kernel 2.6.26.5-45.fc9.x86_64.

    I've got header files installed and I've got gcc installed, but for some reason, ndiswrapper won't install. I get the following error message when I try to make.

    make -C driver
    make[1]: Entering directory /home/mustardsteve/Desktop/ndiswrapper-1.53/driver' make -C /usr/src/kernels/2.6.26.5-45.fc9.x86_64 M=/home/mustardsteve/Desktop/ndiswrapper-1.53/driver make[2]: Entering directory/usr/src/kernels/2.6.26.5-45.fc9.x86_64'
    CC [M] /home/mustardsteve/Desktop/ndiswrapper-1.53/driver/iw_ndis.o
    /home/mustardsteve/Desktop/ndiswrapper-1.53/driver/iw_ndis.c: In function ‘ndis_translate_scan’:
    /home/mustardsteve/Desktop/ndiswrapper-1.53/driver/iw_ndis.c:1037: warning: passing argument 1 of ‘iwe_stream_add_event’ from incompatible pointer type
    /home/mustardsteve/Desktop/ndiswrapper-1.53/driver/iw_ndis.c:1037: warning: passing argument 3 of ‘iwe_stream_add_event’ from incompatible pointer type
    /home/mustardsteve/Desktop/ndiswrapper-1.53/driver/iw_ndis.c:1037: warning: passing argument 4 of ‘iwe_stream_add_event’ makes pointer from integer without a cast
    /home/mustardsteve/Desktop/ndiswrapper-1.53/driver/iw_ndis.c:1037: error: too few arguments to function ‘iwe_stream_add_event’
    /home/mustardsteve/Desktop/ndiswrapper-1.53/driver/iw_ndis.c:1047: warning: passing argument 1 of ‘iwe_stream_add_point’ from incompatible pointer type
    /home/mustardsteve/Desktop/ndiswrapper-1.53/driver/iw_ndis.c:1047: warning: passing argument 3 of ‘iwe_stream_add_point’ from incompatible pointer type
    /home/mustardsteve/Desktop/ndiswrapper-1.53/driver/iw_ndis.c:1047: warning: passing argument 4 of ‘iwe_stream_add_point’ from incompatible pointer type
    /home/mustardsteve/Desktop/ndiswrapper-1.53/driver/iw_ndis.c:1047: error: too few arguments to function ‘iwe_stream_add_point’
    /home/mustardsteve/Desktop/ndiswrapper-1.53/driver/iw_ndis.c:1053: warning: passing argument 1 of ‘iwe_stream_add_event’ from incompatible pointer type
    /home/mustardsteve/Desktop/ndiswrapper-1.53/driver/iw_ndis.c:1053: warning: passing argument 3 of ‘iwe_stream_add_event’ from incompatible pointer type
    /home/mustardsteve/Desktop/ndiswrapper-1.53/driver/iw_ndis.c:1053: warning: passing argument 4 of ‘iwe_stream_add_event’ makes pointer from integer without a cast
    /home/mustardsteve/Desktop/ndiswrapper-1.53/driver/iw_ndis.c:1053: error: too few arguments to function ‘iwe_stream_add_event’
    /home/mustardsteve/Desktop/ndiswrapper-1.53/driver/iw_ndis.c:1064: warning: passing argument 1 of ‘iwe_stream_add_event’ from incompatible pointer type
    /home/mustardsteve/Desktop/ndiswrapper-1.53/driver/iw_ndis.c:1064: warning: passing argument 3 of ‘iwe_stream_add_event’ from incompatible pointer type
    /home/mustardsteve/Desktop/ndiswrapper-1.53/driver/iw_ndis.c:1064: warning: passing argument 4 of ‘iwe_stream_add_event’ makes pointer from integer without a cast
    /home/mustardsteve/Desktop/ndiswrapper-1.53/driver/iw_ndis.c:1064: error: too few arguments to function ‘iwe_stream_add_event’
    /home/mustardsteve/Desktop/ndiswrapper-1.53/driver/iw_ndis.c:1079: warning: passing argument 1 of ‘iwe_stream_add_event’ from incompatible pointer type
    /home/mustardsteve/Desktop/ndiswrapper-1.53/driver/iw_ndis.c:1079: warning: passing argument 3 of ‘iwe_stream_add_event’ from incompatible pointer type
    /home/mustardsteve/Desktop/ndiswrapper-1.53/driver/iw_ndis.c:1079: warning: passing argument 4 of ‘iwe_stream_add_event’ makes pointer from integer without a cast
    /home/mustardsteve/Desktop/ndiswrapper-1.53/driver/iw_ndis.c:1079: error: too few arguments to function ‘iwe_stream_add_event’
    /home/mustardsteve/Desktop/ndiswrapper-1.53/driver/iw_ndis.c:1093: warning: passing argument 1 of ‘iwe_stream_add_event’ from incompatible pointer type
    /home/mustardsteve/Desktop/ndiswrapper-1.53/driver/iw_ndis.c:1093: warning: passing argument 3 of ‘iwe_stream_add_event’ from incompatible pointer type
    /home/mustardsteve/Desktop/ndiswrapper-1.53/driver/iw_ndis.c:1093: warning: passing argument 4 of ‘iwe_stream_add_event’ makes pointer from integer without a cast
    /home/mustardsteve/Desktop/ndiswrapper-1.53/driver/iw_ndis.c:1093: error: too few arguments to function ‘iwe_stream_add_event’
    /home/mustardsteve/Desktop/ndiswrapper-1.53/driver/iw_ndis.c:1104: warning: passing argument 1 of ‘iwe_stream_add_point’ from incompatible pointer type
    /home/mustardsteve/Desktop/ndiswrapper-1.53/driver/iw_ndis.c:1104: warning: passing argument 3 of ‘iwe_stream_add_point’ from incompatible pointer type
    /home/mustardsteve/Desktop/ndiswrapper-1.53/driver/iw_ndis.c:1104: warning: passing argument 4 of ‘iwe_stream_add_point’ from incompatible pointer type
    /home/mustardsteve/Desktop/ndiswrapper-1.53/driver/iw_ndis.c:1104: error: too few arguments to function ‘iwe_stream_add_point’
    /home/mustardsteve/Desktop/ndiswrapper-1.53/driver/iw_ndis.c:1120: warning: passing argument 1 of ‘iwe_stream_add_value’ from incompatible pointer type
    /home/mustardsteve/Desktop/ndiswrapper-1.53/driver/iw_ndis.c:1120: warning: passing argument 4 of ‘iwe_stream_add_value’ from incompatible pointer type
    /home/mustardsteve/Desktop/ndiswrapper-1.53/driver/iw_ndis.c:1120: warning: passing argument 5 of ‘iwe_stream_add_value’ makes pointer from integer without a cast
    /home/mustardsteve/Desktop/ndiswrapper-1.53/driver/iw_ndis.c:1120: error: too few arguments to function ‘iwe_stream_add_value’
    /home/mustardsteve/Desktop/ndiswrapper-1.53/driver/iw_ndis.c:1131: warning: passing argument 1 of ‘iwe_stream_add_point’ from incompatible pointer type
    /home/mustardsteve/Desktop/ndiswrapper-1.53/driver/iw_ndis.c:1131: warning: passing argument 3 of ‘iwe_stream_add_point’ from incompatible pointer type
    /home/mustardsteve/Desktop/ndiswrapper-1.53/driver/iw_ndis.c:1131: warning: passing argument 4 of ‘iwe_stream_add_point’ from incompatible pointer type
    /home/mustardsteve/Desktop/ndiswrapper-1.53/driver/iw_ndis.c:1131: error: too few arguments to function ‘iwe_stream_add_point’
    /home/mustardsteve/Desktop/ndiswrapper-1.53/driver/iw_ndis.c:1137: warning: passing argument 1 of ‘iwe_stream_add_point’ from incompatible pointer type
    /home/mustardsteve/Desktop/ndiswrapper-1.53/driver/iw_ndis.c:1137: warning: passing argument 3 of ‘iwe_stream_add_point’ from incompatible pointer type
    /home/mustardsteve/Desktop/ndiswrapper-1.53/driver/iw_ndis.c:1137: warning: passing argument 4 of ‘iwe_stream_add_point’ from incompatible pointer type
    /home/mustardsteve/Desktop/ndiswrapper-1.53/driver/iw_ndis.c:1137: error: too few arguments to function ‘iwe_stream_add_point’
    /home/mustardsteve/Desktop/ndiswrapper-1.53/driver/iw_ndis.c:1159: warning: passing argument 1 of ‘iwe_stream_add_point’ from incompatible pointer type
    /home/mustardsteve/Desktop/ndiswrapper-1.53/driver/iw_ndis.c:1159: warning: passing argument 3 of ‘iwe_stream_add_point’ from incompatible pointer type
    /home/mustardsteve/Desktop/ndiswrapper-1.53/driver/iw_ndis.c:1159: warning: passing argument 4 of ‘iwe_stream_add_point’ from incompatible pointer type
    /home/mustardsteve/Desktop/ndiswrapper-1.53/driver/iw_ndis.c:1159: error: too few arguments to function ‘iwe_stream_add_point’
    make[3]: [/home/mustardsteve/Desktop/ndiswrapper-1.53/driver/iw_ndis.o] Error 1
    make[2]:
    [module/home/mustardsteve/Desktop/ndiswrapper-1.53/driver] Error 2
    make[2]: Leaving directory /usr/src/kernels/2.6.26.5-45.fc9.x86_64' make[1]: *** [modules] Error 2 make[1]: Leaving directory/home/mustardsteve/Desktop/ndiswrapper-1.53/driver'
    make: *** [all] Error 2
    [root@localhost ndiswrapper-1.53]#

     
    • Nelson Antunes Terra

      1.53 is not the latest version??

      thanks

       
    • Georg Schild

      Georg Schild - 2008-10-01

      Get latest ndiswrapper from svn and try again

      Georg

       

Log in to post a comment.