hkperoth - 2006-08-07

I try to compile mp3blaster 3.2.3 with pth enabled, however, the process failed during make.

Below is my a breif of system config:

Kernel : 2.6.17-1.2157_FC5
CPU : P3 866
MEM : 512MB
mp3blaster version : 3.2.3
pth version : 2.0.7
sound card : Ensoniq AudioPCI(Alsa Mixer)

Brief output of configure --with-pth as below:Summary:

Support audio formats: mp3 wav ogg
Audio output drivers : oss

Misc:
static binaries        no
lirc                   no
libpth                 yes
pthreads or pth        pth

Brief Output of make as below :

main.cc: In function ‘int main(int, char**, char**)’:
main.cc:5401: error: ‘struct main(int, char**, char**)::_tmp’ has no member named ‘threads’
make[2]: *** [main.o] Error 1
make[2]: Leaving directory `/root/mp3blaster-3.2.3/src'
make[1]: *** [all-recursive] Error 1
make[1]: Leaving directory `/root/mp3blaster-3.2.3'
make: *** [all] Error 2

Please HELP!

Below, when using OS Specific PTHREAD, sound will skip when playing a song!