Hello Dan,

The version 2.6.5 still have some issues with current Apache 2.4 code. The 2.7 version must fix it and will be released soon. If you want i can send you a tarball for testing.



On Thu, May 10, 2012 at 5:07 PM, Dan Denton <ddenton@remitpro.com> wrote:

Iím compiling modsec 2.6.5 against Apache 2.4.2, and during a ďmake CFLAGS=-DMSC_TEST testĒ I get the following:

msc_test-modsecurity.o: In function `modsecurity_init':

modsecurity.c:(.text+0x240): undefined reference to `ap_unixd_set_global_mutex_perms'

modsecurity.c:(.text+0x291): undefined reference to `ap_unixd_set_global_mutex_perms'

collect2: ld returned 1 exit status

make[2]: *** [msc_test] Error 1

make[2]: Leaving directory `/opt/modsecurity-apache_2.6.5/tests'

make[1]: *** [check-am] Error 2

make[1]: Leaving directory `/opt/modsecurity-apache_2.6.5/tests'

make: *** [check-recursive] Error 1

Iím having trouble finding a work-around or solution for this. Can anyone point me in the right direction?



Live Security Virtual Conference
Exclusive live event will cover all the ways today's security and
threat landscape has changed and how IT managers can respond. Discussions
will include endpoint security, mobile security and the latest in malware
threats. http://www.accelacomm.com/jaw/sfrnl04242012/114/50122263/
mod-security-users mailing list
Commercial ModSecurity Rules and Support from Trustwave's SpiderLabs: