Help save net neutrality! Learn more.
Close

#22 Error in configure 3.9.63 - same as ID: 3481260

developer
closed
None
5
2016-07-14
2012-02-04
lisa
No

I have the same error as ID 3481260 on Cygwin, which I reinstalled several times, entirely, with no change.
I do not have an error file to attach, but it is exactly the same as ID: 3481260

When I try 'make' afterwards, I get the following:

make -f Make.top build
make[1]: Entering directory `/home/Isa/ATLAS/build'
Make.top:1: Make.inc: No such file or directory
make[1]: *** No rule to make target `Make.inc'. Stop.
make[1]: Leaving directory `/home/Isa/ATLAS/build'
Makefile:482: recipe for target `build' failed
make: *** [build] Error 2

The configure error is here:

Isa@Isa-PC ~
$ ls
ATLAS atlas3.9.63.tar.bz2 cblas.tgz nmfens-linux32-0.91.tar.gz

Isa@Isa-PC ~
$ cd ATLAS

Isa@Isa-PC ~/ATLAS
$ ls
CONFIG INSTALL.txt README configure include lib results tune
EXtest Make.top bin doc interfaces makes src

Isa@Isa-PC ~/ATLAS
$ mkdir build

Isa@Isa-PC ~/ATLAS
$ ls
CONFIG INSTALL.txt README build doc interfaces makes src
EXtest Make.top bin configure include lib results tune

Isa@Isa-PC ~/ATLAS
$ cd build

Isa@Isa-PC ~/ATLAS/build
$ ../configure -b 64 --prefix='pwd'
gcc -I/cygdrive/c/cygwin//home/Isa/ATLAS/build/..//CONFIG/include -g -w -c /cygdrive/c/cygwin//home/Isa/ATLAS/build/..//CONFIG/src/atlconf_misc.c
gcc -I/cygdrive/c/cygwin//home/Isa/ATLAS/build/..//CONFIG/include -g -w -o xconfig /cygdrive/c/cygwin//home/Isa/ATLAS/build/..//CONFIG/src/config.c atlconf_misc.o
./xconfig -d s /cygdrive/c/cygwin//home/Isa/ATLAS/build/../ -d b /cygdrive/c/cygwin//home/Isa/ATLAS/build -b 64

OS configured as WinNT (8)

Assembly configured as GAS_x8632 (1)

Vector ISA Extension configured as SSE3 (5,224)

Architecture configured as Corei1 (21)

Clock rate configured as 1995Mhz

Maximum number of threads configured as 2
Parallel make command configured as '$(MAKE)'
Cannot detect CPU throttling.
gcc -I/cygdrive/c/cygwin//home/Isa/ATLAS/build/..//CONFIG/include -g -w -o xisgcc /cygdrive/c/cygwin//home/Isa/ATLAS/build/..//CONFIG/src/IsGcc.c atlconf_misc.o
gcc -I/cygdrive/c/cygwin//home/Isa/ATLAS/build/..//CONFIG/include -g -w -c /cygdrive/c/cygwin//home/Isa/ATLAS/build/..//CONFIG/src/probe_comp.c
gcc -I/cygdrive/c/cygwin//home/Isa/ATLAS/build/..//CONFIG/include -g -w -o xprobe_comp probe_comp.o atlconf_misc.o
rm -f config1.out
make atlas_run atldir=/cygdrive/c/cygwin//home/Isa/ATLAS/build exe=xprobe_comp args="-v 0 -o atlconf.txt -O 8 -A 21 -Si nof77 0 -b 64" \ redir=config1.out
make[1]: Entering directory `/home/Isa/ATLAS/build'
cd /cygdrive/c/cygwin//home/Isa/ATLAS/build ; ./xprobe_comp -v 0 -o atlconf.txt -O 8 -A 21 -Si nof77 0 -b 64 > config1.out
sh: -c: line 0: syntax error near unexpected token `('
sh: -c: line 0: `find $HOME/local /usr/local/bin /usr/bin /cygdrive/c/Program\ Files/Common\ Files/Microsoft\ Shared/Windows\ Live /cygdrive/c/Program\ Files\ (x86)/Common\ Files/Microsoft\ Shared/Windows\ Live /cygdrive/c/Windows/system32 /cygdrive/c/Windows /cygdrive/c/Windows/System32/Wbem /cygdrive/c/Windows/System32/WindowsPowerShell/v1.0 /cygdrive/c/Program\ Files/Dell/DW\ WLAN\ Card/Driver /cygdrive/c/Program\ Files\ (x86)/Common\ Files/Roxio\ Shared/DLLShared /cygdrive/c/Program\ Files\ (x86)/Windows\ Live/Shared /cygdrive/c/Program\ Files\ (x86)/QuickTime/QTSystem /cygdrive/c/Program\ Files\ (x86)/CodeBlocks/MinGW/bin /usr/lib/lapack -name '*gcc*' -exec ./xisgcc '{}' \; > /tmp/t1cf4.0 2>&1'
assertion "fpin" failed: file "/cygdrive/c/cygwin//home/Isa/ATLAS/build/..//CONFIG/src/atlconf_misc.c", line 873, function: GetLinesFromFile
/bin/sh: line 1: 7412 Aborted (core dumped) ./xprobe_comp -v 0 -o atlconf.txt -O 8 -A 21 -Si nof77 0 -b 64 > config1.out
Makefile:106: recipe for target `atlas_run' failed
make[1]: *** [atlas_run] Error 134
make[1]: Leaving directory `/home/Isa/ATLAS/build'
Makefile:117: recipe for target `IRun_comp' failed
make: *** [IRun_comp] Error 2
ERROR 512 IN SYSCMND: 'make IRun_comp args="-v 0 -o atlconf.txt -O 8 -A 21 -Si nof77 0 -b 64"'
mkdir src bin tune interfaces
cd src ; mkdir testing auxil blas lapack pthreads threads
cd src/blas ; \ mkdir f77reference reference gemv ger gemm kbmm \ level1 level2 level3 pklevel3
cd src/blas/reference ; mkdir level1 level2 level3
cd src/blas/level2 ; mkdir kernel
cd src/blas/pklevel3 ; mkdir gpmm sprk
cd src/blas/level3 ; mkdir rblas kernel
cd src/pthreads ; mkdir blas misc
cd src/pthreads/blas ; mkdir level1 level2 level3
cd src/threads ; mkdir blas lapack
cd src/threads/blas ; mkdir level3 level2
cd tune ; mkdir blas sysinfo lapack threads
cd tune/blas ; mkdir gemm gemv ger level1 level3
cd interfaces ; mkdir blas lapack
cd interfaces/lapack ; mkdir C F77
cd interfaces/lapack/C ; mkdir src testing
cd interfaces/lapack/F77 ; mkdir src testing
cd interfaces/blas ; mkdir C F77
cd interfaces/blas/C ; mkdir src testing
cd interfaces/blas/F77 ; mkdir src testing
cd interfaces/lapack ; mkdir C2F
cd interfaces/lapack/C2F ; mkdir src
mkdir ARCHS
make -f Make.top startup
make[1]: Entering directory `/home/Isa/ATLAS/build'
Make.top:1: Make.inc: No such file or directory
make[1]: *** No rule to make target `Make.inc'. Stop.
make[1]: Leaving directory `/home/Isa/ATLAS/build'
Makefile:487: recipe for target `startup' failed
make: *** [startup] Error 2
mv: cannot stat `lib/Makefile': No such file or directory
../configure: line 410: lib/Makefile: No such file or directory
../configure: line 411: lib/Makefile: No such file or directory
../configure: line 412: lib/Makefile: No such file or directory
../configure: line 413: lib/Makefile: No such file or directory
../configure: line 469: lib/Makefile: No such file or directory
DONE configure

Isa@Isa-PC ~/ATLAS/build
$ make
make -f Make.top build
make[1]: Entering directory `/home/Isa/ATLAS/build'
Make.top:1: Make.inc: No such file or directory
make[1]: *** No rule to make target `Make.inc'. Stop.
make[1]: Leaving directory `/home/Isa/ATLAS/build'
Makefile:482: recipe for target `build' failed
make: *** [build] Error 2

Isa@Isa-PC ~/ATLAS/build
$ make build
make -f Make.top build
make[1]: Entering directory `/home/Isa/ATLAS/build'
Make.top:1: Make.inc: No such file or directory
make[1]: *** No rule to make target `Make.inc'. Stop.
make[1]: Leaving directory `/home/Isa/ATLAS/build'
Makefile:482: recipe for target `build' failed
make: *** [build] Error 2

Discussion

  • lisa

    lisa - 2012-02-06

    I tried the configure with the -b 32 and I have exactly the same error messages.

     
  • R. Clint Whaley

    R. Clint Whaley - 2012-03-07

    Yes, I broke windows support during the configure rewrite. I just got a windows machine working, and still have to do some configuration before I can start installing ATLAS and figuring out what I did.

    Sorry,
    Clint

     
  • R. Clint Whaley

    R. Clint Whaley - 2012-03-07
    • assigned_to: nobody --> rwhaley
     
  • R. Clint Whaley

    R. Clint Whaley - 2012-06-13

    Hi,

    I am very sorry for the looong delay, but I think I have gotten Windows fully supported in ATLAS 3.9.79. Using it, you can build 32-bit libs using either the cygwin compilers or the MinGW compilers, though you still need cygwin installed. The ATLAS installation guide that comes with the tarfile has Windows-specific installation instructions.

    Can you try 3.9.79 and let me know if it works for you?

    Many thanks,
    Clint

     
  • R. Clint Whaley

    R. Clint Whaley - 2012-06-13
    • status: open --> open-fixed
     
  • R. Clint Whaley

    R. Clint Whaley - 2016-07-14
    • status: open-fixed --> closed
    • Group: --> developer
     
  • R. Clint Whaley

    R. Clint Whaley - 2016-07-14

    Sorry for the extreme neglect. I have overwhelmed, and have not been able to provide support for some time. In order to get back to even, I am mass closing existing old support requests.

    If your support request involved the stable release, please try the new 3.10.3BETA release that you can find under the developer releases. That is the release that I have updated to work better on modern hardware, including MacOS and Windows. If you still have a problem with 3.10.3BETA, please open up a new ticket, and I will try to get it fixed before the official 3.10.3 release. Please note t
    he updated ATLAS/doc/atlas_install.pdf: the online document is still for 3.10.2,
    and will remain so until 3.10.3's official release.

    If your support request involved the developer release, I recommend waiting for 3.11.39 before reopening, as I am currently in the middle of a major rewrite. If the problem persists into .39, I definitely want to hear about it.

    Thank you, and I am very sorry about my responsiveness on support.

     

Log in to post a comment.