Sergio Rojas - 2014-02-16

Hello all,

Iam looking for help to compile atlas3.11.25 on a i7-4700MQ CPU @ 2.40GHz
box. So far the configure script is failing because (I think and don't
know how to fix it) it does not have right options for
Architecture configured as Corei3.

I am getting to such conclusion because of the outputs of the configure
script for atlas3.11.25 (which I am including below as compared
with the output for atlas3.10.1 which I was able
to build and install but it was done as if the processor
were a Corei1.

Thanks in avance for your help.

Sergio

configure output from atlas3.11.25

Script started on Sun 16 Feb 2014 09:01:39 AM EST
$:~/ZZ_Prog_src/AtlasLapack/ATLAS/z_my

$ ../configure -b 64 -Fa alg -fPIC \

   --prefix=/opt/myProg/NumLibs64b \

.tarwith-netlib-lapack-tarfile=/opt/ZZ_Prog_src/AtlasLapack/lapack-3.5.0
gcc -I/opt/ZZ_Prog_src/AtlasLapack/ATLAS/z_my/..//CONFIG/include -g -w -c /opt/
ZZ_Prog_src/AtlasLapack/ATLAS/z_my/..//CONFIG/src/atlconf_misc.c
gcc -I/opt/ZZ_Prog_src/AtlasLapack/ATLAS/z_my/..//CONFIG/include -g -w -o xconf
ig /opt/ZZ_Prog_src/AtlasLapack/ATLAS/z_my/..//CONFIG/src/config.c atlconf_misc.
o
./xconfig -d s /opt/ZZ_Prog_src/AtlasLapack/ATLAS/z_my/../ -d b /opt/ZZ_Prog_src
/AtlasLapack/ATLAS/z_my -b 64 -Fa alg -fPIC -Si lapackref 1

OS configured as Linux (1)

Assembly configured as GAS_x8664 (2)

Vector ISA Extension configured as AVXMAC (4,976)

Architecture configured as Corei3 (28)

Clock rate configured as 2401Mhz

Maximum number of threads configured as 8
Parallel make command configured as '$(MAKE) -j 8'
Cannot detect CPU throttling.
gcc -I/opt/ZZ_Prog_src/AtlasLapack/ATLAS/z_my/..//CONFIG/include -g -w -o xisgc
c /opt/ZZ_Prog_src/AtlasLapack/ATLAS/z_my/..//CONFIG/src/IsGcc.c atlconf_misc.o

gcc -I/opt/ZZ_Prog_src/AtlasLapack/ATLAS/z_my/..//CONFIG/include -g -w -c /opt/
ZZ_Prog_src/AtlasLapack/ATLAS/z_my/..//CONFIG/src/probe_comp.c
gcc -I/opt/ZZ_Prog_src/AtlasLapack/ATLAS/z_my/..//CONFIG/include -g -w -o xprob
e_comp probe_comp.o atlconf_misc.o
rm -f config1.out
make atlas_run atldir=/opt/ZZ_Prog_src/AtlasLapack/ATLAS/z_my exe=xprobe_comp re
dir=config1.out \ args="-v 0 -o atlconf.txt -O 1 -A 28 -Si nof77 0 -V 976 -Fa ic
'-fPIC' -Fa sm '-fPIC' -Fa dm '-fPIC' -Fa sk '-fPIC' -Fa dk '-fPIC' -Fa xc '-fPI
C' -Fa gc '-fPIC' -Fa if '-fPIC' -b 64 -d b /opt/ZZ_Prog_src/AtlasLapack/ATLAS/z
_my"
make[1]: Entering directory `/opt/ZZ_Prog_src/AtlasLapack/ATLAS/z_my'
cd /opt/ZZ_Prog_src/AtlasLapack/ATLAS/z_my ; ./xprobe_comp -v 0 -o atlconf.txt -
O 1 -A 28 -Si nof77 0 -V 976 -Fa ic '-fPIC' -Fa sm '-fPIC' -Fa dm '-fPIC' -Fa s
k '-fPIC' -Fa dk '-fPIC' -Fa xc '-fPIC' -Fa gc '-fPIC' -Fa if '-fPIC' -b 64 -d b
/opt/ZZ_Prog_src/AtlasLapack/ATLAS/z_my > config1.out
sh: 2: Syntax error: EOF in backquote substitution
sh: 2: Syntax error: EOF in backquote substitution
sh: 2: Syntax error: EOF in backquote substitution
cc1: error: unrecognized command line option ‘-mavx2’
make[2]: [IRunCComp] Error 1
cc1: error: unrecognized command line option ‘-mavx2’
make[2]:
[IRunCComp] Error 1

Unable to find usable compiler for ICC; abortingMake sure compilers are in your
path, and specify good compilers to configure
(see INSTALL.txt or 'configure --help' for details)make[1]: [atlas_run] Erro
r 1
make[1]: Leaving directory /opt/ZZ_Prog_src/AtlasLapack/ATLAS/z_my' make: *** [IRun_comp] Error 2 ERROR 512 IN SYSCMND: 'make IRun_comp args="-v 0 -o atlconf.txt -O 1 -A 28 -Si n of77 0 -V 976 -Fa ic '-fPIC' -Fa sm '-fPIC' -Fa dm '-fPIC' -Fa sk '-fPIC' -Fa d k '-fPIC' -Fa xc '-fPIC' -Fa gc '-fPIC' -Fa if '-fPIC' -b 64"' mkdir src bin tune interfaces cd src ; mkdir testing auxil blas lapack pthreads threads cd src/blas ; \ mkdir f77reference reference gemv ger gemm ammm kbmm \ level1 level2 level3 pklevel3 cd src/blas/reference ; mkdir level1 level2 level3 cd src/blas/level2 ; mkdir kernel cd src/blas/pklevel3 ; mkdir gpmm sprk cd src/blas/level3 ; mkdir rblas kernel cd src/pthreads ; mkdir blas misc cd src/pthreads/blas ; mkdir level1 level2 level3 cd src/threads ; mkdir blas lapack cd src/threads/blas ; mkdir level3 level2 cd tune ; mkdir blas sysinfo lapack threads cd tune/blas ; mkdir gemm gemv ger level1 level3 cd interfaces ; mkdir blas lapack cd interfaces/lapack ; mkdir C F77 cd interfaces/lapack/C ; mkdir src testing cd interfaces/lapack/F77 ; mkdir src testing cd interfaces/blas ; mkdir C F77 cd interfaces/blas/C ; mkdir src testing cd interfaces/blas/F77 ; mkdir src testing cd interfaces/lapack ; mkdir C2F cd interfaces/lapack/C2F ; mkdir src mkdir ARCHS make -f Make.top startup make[1]: Entering directory/opt/ZZ_Prog_src/AtlasLapack/ATLAS/z_my'
Make.top:1: Make.inc: No such file or directory
Make.top:325: warning: overriding commands for target /AtlasTest' Make.top:76: warning: ignoring old commands for target/AtlasTest'
make[1]:
No rule to make target Make.inc'. Stop. make[1]: Leaving directory/opt/ZZ_Prog_src/AtlasLapack/ATLAS/z_my'
make: *** [startup] Error 2
mv: cannot stat `lib/Makefile': No such file or directory
../configure: 524: ../configure: cannot create lib/Makefile: Directory nonexiste
nt
../configure: 525: ../configure: cannot create lib/Makefile: Directory nonexiste
nt
../configure: 526: ../configure: cannot create lib/Makefile: Directory nonexiste
nt
../configure: 527: ../configure: cannot create lib/Makefile: Directory nonexiste
nt
../configure: 583: ../configure: cannot create lib/Makefile: Directory nonexiste
nt
DONE configure
$:~/ZZ_Prog_src/AtlasLapack/ATLAS/z_my

$ exit
exit

Script done on Sun 16 Feb 2014 09:02:08 AM EST