#18 UBUNTU make errors

0.9.71
closed-invalid
5
2007-12-23
2007-12-22
Anonymous
No

sudo make
+ Entering lxdialog
Compiling checklist.o
In file included from checklist.c:24:
dialog.h:31:20: error: curses.h: No such file or directory
In file included from checklist.c:24:
dialog.h:128: error: expected ‘=’, ‘,’, ‘;’, ‘asm’ or ‘__attribute__’ before ‘use_colors’
dialog.h:129: error: expected ‘=’, ‘,’, ‘;’, ‘asm’ or ‘__attribute__’ before ‘use_shadow’
dialog.h:131: error: expected ‘=’, ‘,’, ‘;’, ‘asm’ or ‘__attribute__’ before ‘attributes’
dialog.h:143: error: expected ‘)’ before ‘*’ token
dialog.h:146: error: expected ‘)’ before ‘*’ token
dialog.h:147: error: expected ‘)’ before ‘*’ token
dialog.h:148: error: expected ‘)’ before ‘*’ token
dialog.h:149: error: expected ‘)’ before ‘*’ token
dialog.h:151: error: expected ‘)’ before ‘*’ token
checklist.c:31: error: expected ‘)’ before ‘*’ token
checklist.c:59: error: expected ‘)’ before ‘*’ token
checklist.c:95: error: expected ‘)’ before ‘*’ token
checklist.c: In function ‘dialog_checklist’:
checklist.c:117: error: ‘WINDOW’ undeclared (first use in this function)
checklist.c:117: error: (Each undeclared identifier is reported only once
checklist.c:117: error: for each function it appears in.)
checklist.c:117: error: ‘dialog’ undeclared (first use in this function)
checklist.c:117: error: ‘list’ undeclared (first use in this function)
checklist.c:117: warning: left-hand operand of comma expression has no effect
checklist.c:121: warning: implicit declaration of function ‘endwin’
checklist.c:122: warning: implicit declaration of function ‘fprintf’
checklist.c:122: warning: incompatible implicit declaration of built-in function ‘fprintf’
checklist.c:122: error: ‘stderr’ undeclared (first use in this function)
checklist.c:140: error: ‘COLS’ undeclared (first use in this function)
checklist.c:141: error: ‘LINES’ undeclared (first use in this function)
checklist.c:143: warning: implicit declaration of function ‘draw_shadow’
checklist.c:143: error: ‘stdscr’ undeclared (first use in this function)
checklist.c:145: warning: implicit declaration of function ‘newwin’
checklist.c:146: warning: implicit declaration of function ‘keypad’
checklist.c:146: error: ‘TRUE’ undeclared (first use in this function)
checklist.c:148: warning: implicit declaration of function ‘draw_box’
checklist.c:148: error: ‘attributes’ undeclared (first use in this function)
checklist.c:149: warning: implicit declaration of function ‘wattrset’
checklist.c:150: warning: implicit declaration of function ‘mvwaddch’
checklist.c:152: warning: implicit declaration of function ‘waddch’
checklist.c:156: warning: implicit declaration of function ‘print_title’
checklist.c:159: warning: implicit declaration of function ‘print_autowrap’
checklist.c:166: warning: implicit declaration of function ‘subwin’
checklist.c:191: warning: implicit declaration of function ‘print_item’
checklist.c:197: warning: implicit declaration of function ‘print_arrows’
checklist.c:200: warning: implicit declaration of function ‘print_buttons’
checklist.c:202: warning: implicit declaration of function ‘wnoutrefresh’
checklist.c:204: warning: implicit declaration of function ‘doupdate’
checklist.c:207: warning: implicit declaration of function ‘wgetch’
checklist.c:214: error: ‘KEY_UP’ undeclared (first use in this function)
checklist.c:214: error: ‘KEY_DOWN’ undeclared (first use in this function)
checklist.c:224: error: ‘FALSE’ undeclared (first use in this function)
checklist.c:225: warning: implicit declaration of function ‘scrollok’
checklist.c:226: warning: implicit declaration of function ‘wscrl’
checklist.c:235: warning: implicit declaration of function ‘wrefresh’
checklist.c:285: warning: incompatible implicit declaration of built-in function ‘fprintf’
checklist.c:286: warning: implicit declaration of function ‘delwin’
checklist.c:290: error: ‘KEY_LEFT’ undeclared (first use in this function)
checklist.c:291: error: ‘KEY_RIGHT’ undeclared (first use in this function)
make[2]: *** [../../obj-x86/build/config/lxdialog/checklist.o] Error 1
make[1]: *** [sub-lxdialog-all] Error 2
make: *** [do-bootstrap] Error 2
eric.standlee@gmail.com

Discussion

  • Joseph Jezak

    Joseph Jezak - 2007-12-23
    • status: open --> closed-invalid
     
  • Joseph Jezak

    Joseph Jezak - 2007-12-23

    Logged In: YES
    user_id=1223416
    Originator: NO

    Sorry, MOL does not build on x86 processors, but you're also missing the ncurses development headers.

     

Log in to post a comment.

Get latest updates about Open Source Projects, Conferences and News.

Sign up for the SourceForge newsletter:





No, thanks