#7 Make Install Problem

open
nobody
5
2004-05-28
2004-05-28
Thomas
No

System Details:
Kernel 2.4.21-215-default
SuSe 9.0

Make Install fails with these messages:
-------- 8< ------------
/lib/modules/2.4.21-215-default/kernel/fs/lufs/lufs.o:
unresolved symbol kunmap_high
/lib/modules/2.4.21-215-default/kernel/fs/lufs/lufs.o:
unresolved symbol put_cmsg
.
.
.
/lib/modules/2.4.21-215-default/kernel/fs/lufs/lufs.o:
insmod
/lib/modules/2.4.21-215-default/kernel/fs/lufs/lufs.o
failed
/lib/modules/2.4.21-215-default/kernel/fs/lufs/lufs.o:
insmod lufs failed
make[5]: *** [install-data-hook] Error 255
make[5]: Leaving directory
`/home/moert1/Downloads/lufs-0.9.7/kernel/Linux/2.4'
make[4]: *** [install-data-am] Error 2
make[4]: Leaving directory
`/home/moert1/Downloads/lufs-0.9.7/kernel/Linux/2.4'
make[3]: *** [install-am] Error 2
make[3]: Leaving directory
`/home/moert1/Downloads/lufs-0.9.7/kernel/Linux/2.4'
make[2]: *** [install-recursive] Error 1
make[2]: Leaving directory
`/home/moert1/Downloads/lufs-0.9.7/kernel/Linux'
make[1]: *** [install-recursive] Error 1
make[1]: Leaving directory
`/home/moert1/Downloads/lufs-0.9.7/kernel'
make: *** [install-recursive] Error 1
--------8< -------------------

Any help is welcome.

Thomas

Discussion


Log in to post a comment.

Get latest updates about Open Source Projects, Conferences and News.

Sign up for the SourceForge newsletter:





No, thanks